Build Failure: py-grako, py27-grako, py35-grako

buildbot at buildbot at
Wed Nov 9 11:16:31 CET 2016

Status:       Failure
Build slave:  ports-10.5_ppc_legacy
Full logs:
Build reason: The SingleBranchScheduler scheduler named 'ports' triggered this build
Port list:    py-grako
Subport list:
	- py-grako
	- py27-grako
	- py35-grako
Variants:     None
Revision:     e39f510fabf5656204a03716a18ab8ef32fd4640
Build time:   0:46:48
Committer:    Andrew Stromnov <stromnov at>

Log from failed builds:
	Building 'py27-grako' ... [ERROR]
	> maintainers: stromnov at
	Building 'py-grako' ... [ERROR] (failed to install dependency 'py27-grako')
	> maintainers: stromnov at
	Building 'py35-grako' ... [ERROR]
	> maintainers: stromnov at

Broken ports:
	- py-grako
	- py27-grako
	- py35-grako

Responsible maintainers:
	- stromnov at

Links to individual build jobs:
- ports-10.5_ppc_legacy-builder #10051
- ports-10.5_ppc_legacy-builder #10052
- ports-10.5_ppc_legacy-builder #10053

Best regards,
MacPorts Buildbot

More information about the macports-builds mailing list