Build Failure: py-csvkit, py27-certifi, py27-csvkit, py27-future, py27-py, py27-pygments, py27-setuptools, py27-sphinxcontrib-websupport, py27-sqlalchemy, py27-typing, and 14 more

buildbot at macports.org buildbot at macports.org
Tue Aug 1 20:11:48 UTC 2017


Status:       Failure
Build slave:  ports-10.5_ppc_legacy
Full logs:    https://build.macports.org/builders/ports-10.5_ppc_legacy-watcher/builds/7161
Build reason: The SingleBranchScheduler scheduler named 'ports' triggered this build
Port list:    py-csvkit
Subport list:
	- py-csvkit
	- py27-csvkit
	- py34-csvkit
	- py35-csvkit
	- py36-csvkit
Variants:     None
Revision:     5dbdc5efd28e12b9d776adcba1982d5c0de218b1
Build time:   0:07:32
Author:       Emre S╠žafak <esafak at users.noreply.github.com>

Log from failed builds:
	Building 'py27-csvkit' ... [ERROR] (failed to install dependency 'py27-setuptools')
	> maintainers: jmr at macports.org.
	Building 'py27-csvkit' ... [ERROR] (failed to install dependency 'py27-tz')
	> maintainers: ram at macports.org.
	Building 'py27-csvkit' ... [ERROR] (failed to install dependency 'py27-pygments')
	> maintainers: stromnov at macports.org.
	Building 'py27-csvkit' ... [ERROR] (failed to install dependency 'py27-certifi')
	> maintainers: stromnov at macports.org.
	Building 'py27-csvkit' ... [ERROR] (failed to install dependency 'py27-sphinxcontrib-websupport')
	> maintainers: .
	Building 'py27-csvkit' ... [ERROR] (failed to install dependency 'py27-typing')
	> maintainers: allan.que at gmail.com.
	Building 'py27-csvkit' ... [ERROR] (failed to install dependency 'py27-py')
	> maintainers: stromnov at macports.org.
	Building 'py27-csvkit' ... [ERROR] (failed to install dependency 'py27-virtualenv')
	> maintainers: larryv at macports.org.
	Building 'py27-csvkit' ... [ERROR] (failed to install dependency 'py27-future')
	> maintainers: petr at macports.org.
	Building 'py27-csvkit' ... [ERROR] (failed to install dependency 'py27-sqlalchemy')
	> maintainers: stromnov at macports.org.
	Building 'py34-csvkit' ... [ERROR] (failed to calculate dependencies)
	> maintainers: .
	Building 'py-csvkit' ... [ERROR] (failed to install dependency 'py27-setuptools')
	> maintainers: jmr at macports.org.
	Building 'py-csvkit' ... [ERROR] (failed to install dependency 'py27-tz')
	> maintainers: ram at macports.org.
	Building 'py-csvkit' ... [ERROR] (failed to install dependency 'py27-pygments')
	> maintainers: stromnov at macports.org.
	Building 'py-csvkit' ... [ERROR] (failed to install dependency 'py27-certifi')
	> maintainers: stromnov at macports.org.
	Building 'py-csvkit' ... [ERROR] (failed to install dependency 'py27-sphinxcontrib-websupport')
	> maintainers: .
	Building 'py-csvkit' ... [ERROR] (failed to install dependency 'py27-typing')
	> maintainers: allan.que at gmail.com.
	Building 'py-csvkit' ... [ERROR] (failed to install dependency 'py27-py')
	> maintainers: stromnov at macports.org.
	Building 'py-csvkit' ... [ERROR] (failed to install dependency 'py27-virtualenv')
	> maintainers: larryv at macports.org.
	Building 'py-csvkit' ... [ERROR] (failed to install dependency 'py27-future')
	> maintainers: petr at macports.org.
	Building 'py-csvkit' ... [ERROR] (failed to install dependency 'py27-sqlalchemy')
	> maintainers: stromnov at macports.org.
	Building 'py35-csvkit' ... [ERROR] (failed to install dependency 'python35')
	> maintainers: jwa at macports.org.
	Building 'py35-csvkit' ... [ERROR] (failed to install dependency 'py35-virtualenv')
	> maintainers: larryv at macports.org.
	Building 'py36-csvkit' ... [ERROR] (failed to install dependency 'python36')
	> maintainers: jwa at macports.org.
	Building 'py36-csvkit' ... [ERROR] (failed to install dependency 'py36-tz')
	> maintainers: ram at macports.org.
	Building 'py36-csvkit' ... [ERROR] (failed to install dependency 'py36-pygments')
	> maintainers: stromnov at macports.org.
	Building 'py36-csvkit' ... [ERROR] (failed to install dependency 'py36-sphinxcontrib-websupport')
	> maintainers: .
	Building 'py36-csvkit' ... [ERROR] (failed to install dependency 'py36-py')
	> maintainers: stromnov at macports.org.
	Building 'py36-csvkit' ... [ERROR] (failed to install dependency 'py36-virtualenv')
	> maintainers: larryv at macports.org.
	Building 'py36-csvkit' ... [ERROR] (failed to install dependency 'py36-sqlalchemy')
	> maintainers: stromnov at macports.org.

Broken ports:
	- py-csvkit
	- py27-certifi
	- py27-csvkit
	- py27-future
	- py27-py
	- py27-pygments
	- py27-setuptools
	- py27-sphinxcontrib-websupport
	- py27-sqlalchemy
	- py27-typing
	- py27-tz
	- py27-virtualenv
	- py34-csvkit
	- py35-csvkit
	- py35-virtualenv
	- py36-csvkit
	- py36-py
	- py36-pygments
	- py36-sphinxcontrib-websupport
	- py36-sqlalchemy
	- py36-tz
	- py36-virtualenv
	- python35
	- python36

Responsible maintainers:
	- allan.que at gmail.com
	- jmr at macports.org
	- jwa at macports.org
	- larryv at macports.org
	- petr at macports.org
	- ram at macports.org
	- stromnov at macports.org

Links to individual build jobs:
- ports-10.5_ppc_legacy-builder #36870
  https://build.macports.org/builders/ports-10.5_ppc_legacy-builder/builds/36870
- ports-10.5_ppc_legacy-builder #36871
  https://build.macports.org/builders/ports-10.5_ppc_legacy-builder/builds/36871
- ports-10.5_ppc_legacy-builder #36872
  https://build.macports.org/builders/ports-10.5_ppc_legacy-builder/builds/36872
- ports-10.5_ppc_legacy-builder #36873
  https://build.macports.org/builders/ports-10.5_ppc_legacy-builder/builds/36873
- ports-10.5_ppc_legacy-builder #36874
  https://build.macports.org/builders/ports-10.5_ppc_legacy-builder/builds/36874

-- 
Best regards,
MacPorts Buildbot
https://build.macports.org/



More information about the macports-builds mailing list