Build Failure on ports-10.5_ppc_legacy: py-astroid, py-certifi, py-ipywidgets, py-jupyter_client, py-pylint, py-setuptools_scm, py-sqlalchemy, py-widgetsnbextension, py26-certifi, py26-sqlalchemy, and 79 more
buildbot at macports.org
buildbot at macports.org
Fri Jan 26 08:29:40 UTC 2018
Status: Failure
Build slave: ports-10.5_ppc_legacy
Full logs: https://build.macports.org/builders/ports-10.5_ppc_legacy-watcher/builds/11353
Build reason: The SingleBranchScheduler scheduler named 'ports' triggered this build
Port list: py-astroid py-certifi py-jupyter_client py-sqlalchemy py-pylint py-widgetsnbextension py-setuptools_scm py-ipywidgets
Subport list:
- py-astroid
- py-certifi
- py-ipywidgets
- py-jupyter_client
- py-pylint
- py-setuptools_scm
- py-sqlalchemy
- py-widgetsnbextension
- py26-certifi
- py26-sqlalchemy
- py27-astroid
- py27-certifi
- py27-ipywidgets
- py27-jupyter_client
- py27-pylint
- py27-setuptools_scm
- py27-sqlalchemy
- py27-widgetsnbextension
- py33-certifi
- py33-sqlalchemy
- py34-astroid
- py34-certifi
- py34-ipywidgets
- py34-jupyter_client
- py34-pylint
- py34-setuptools_scm
- py34-sqlalchemy
- py34-widgetsnbextension
- py35-astroid
- py35-certifi
- py35-ipywidgets
- py35-jupyter_client
- py35-pylint
- py35-setuptools_scm
- py35-sqlalchemy
- py35-widgetsnbextension
- py36-astroid
- py36-certifi
- py36-ipywidgets
- py36-jupyter_client
- py36-pylint
- py36-setuptools_scm
- py36-sqlalchemy
- py36-widgetsnbextension
Variants: None
Revision: 943f6e205d614b6091cc8b5afe27d33dbfcb97ec
Build time: 1:25:57
Author: Andrew Stromnov <stromnov at gmail.com>
Log from failed builds:
Building 'py-certifi' ... [ERROR] (failed to install dependency 'py27-certifi')
> maintainers: stromnov at macports.org,stromnov at macports.org.
Building 'py-astroid' ... [ERROR] (failed to install dependency 'py27-astroid')
> maintainers: stromnov at macports.org,stromnov at macports.org.
Building 'py27-jupyter_client' ... [ERROR] (failed to install dependency 'py27-decorator')
> maintainers: stromnov at macports.org,stromnov at macports.org.
Building 'py27-jupyter_client' ... [ERROR] (failed to install dependency 'py27-ipython_genutils')
> maintainers: stromnov at macports.org,stromnov at macports.org.
Building 'py27-jupyter_client' ... [ERROR] (failed to install dependency 'py27-zmq')
> maintainers: stromnov at macports.org,jrjsmrtn at gmail.com,michaelld at macports.org.
Building 'py-pylint' ... [ERROR] (failed to install dependency 'py27-astroid')
> maintainers: blair at macports.org,stromnov at macports.org,stromnov at macports.org.
Building 'py27-pylint' ... [ERROR] (failed to install dependency 'py27-astroid')
> maintainers: blair at macports.org,stromnov at macports.org,stromnov at macports.org.
Building 'py27-sqlalchemy' ... [ERROR]
> maintainers: stromnov at macports.org.
Building 'py-sqlalchemy' ... [ERROR] (failed to install dependency 'py27-sqlalchemy')
> maintainers: stromnov at macports.org,stromnov at macports.org.
Building 'py27-certifi' ... [ERROR]
> maintainers: stromnov at macports.org.
Building 'py-jupyter_client' ... [ERROR] (failed to install dependency 'py27-decorator')
> maintainers: stromnov at macports.org,stromnov at macports.org.
Building 'py-jupyter_client' ... [ERROR] (failed to install dependency 'py27-ipython_genutils')
> maintainers: stromnov at macports.org,stromnov at macports.org.
Building 'py-jupyter_client' ... [ERROR] (failed to install dependency 'py27-zmq')
> maintainers: stromnov at macports.org,jrjsmrtn at gmail.com,michaelld at macports.org.
Building 'py27-ipywidgets' ... [ERROR] (failed to install dependency 'py27-decorator')
> maintainers: stromnov at macports.org,stromnov at macports.org.
Building 'py27-ipywidgets' ... [ERROR] (failed to install dependency 'py27-scandir')
> maintainers: stromnov at macports.org,stromnov at macports.org.
Building 'py27-ipywidgets' ... [ERROR] (failed to install dependency 'py27-ptyprocess')
> maintainers: stromnov at macports.org,stromnov at macports.org.
Building 'py27-ipywidgets' ... [ERROR] (failed to install dependency 'py27-pygments')
> maintainers: stromnov at macports.org,stromnov at macports.org.
Building 'py27-ipywidgets' ... [ERROR] (failed to install dependency 'py27-wcwidth')
> maintainers: stromnov at macports.org,xeron.oskom at gmail.com.
Building 'py27-ipywidgets' ... [ERROR] (failed to install dependency 'py27-ipython_genutils')
> maintainers: stromnov at macports.org,stromnov at macports.org.
Building 'py27-ipywidgets' ... [ERROR] (failed to install dependency 'py27-zmq')
> maintainers: stromnov at macports.org,jrjsmrtn at gmail.com,michaelld at macports.org.
Building 'py27-ipywidgets' ... [ERROR] (failed to install dependency 'py27-certifi')
> maintainers: stromnov at macports.org,stromnov at macports.org.
Building 'py27-ipywidgets' ... [ERROR] (failed to install dependency 'py27-monotonic')
> maintainers: stromnov at macports.org,stromnov at macports.org.
Building 'py27-ipywidgets' ... [ERROR] (failed to install dependency 'py27-html5lib')
> maintainers: stromnov at macports.org.
Building 'py27-ipywidgets' ... [ERROR] (failed to install dependency 'py27-mistune')
> maintainers: stromnov at macports.org,stromnov at macports.org.
Building 'py27-ipywidgets' ... [ERROR] (failed to install dependency 'py27-jsonschema')
> maintainers: stromnov at macports.org,stromnov at macports.org.
Building 'py27-ipywidgets' ... [ERROR] (failed to install dependency 'py27-pandocfilters')
> maintainers: stromnov at macports.org,stromnov at macports.org.
Building 'py27-ipywidgets' ... [ERROR] (failed to install dependency 'py27-send2trash')
> maintainers: stromnov at macports.org,stromnov at macports.org.
Building 'py33-certifi' ... [ERROR]
> maintainers: stromnov at macports.org.
Building 'py27-widgetsnbextension' ... [ERROR] (failed to install dependency 'py27-decorator')
> maintainers: stromnov at macports.org,stromnov at macports.org.
Building 'py27-widgetsnbextension' ... [ERROR] (failed to install dependency 'py27-scandir')
> maintainers: stromnov at macports.org,stromnov at macports.org.
Building 'py27-widgetsnbextension' ... [ERROR] (failed to install dependency 'py27-ptyprocess')
> maintainers: stromnov at macports.org,stromnov at macports.org.
Building 'py27-widgetsnbextension' ... [ERROR] (failed to install dependency 'py27-pygments')
> maintainers: stromnov at macports.org,stromnov at macports.org.
Building 'py27-widgetsnbextension' ... [ERROR] (failed to install dependency 'py27-wcwidth')
> maintainers: stromnov at macports.org,xeron.oskom at gmail.com.
Building 'py27-widgetsnbextension' ... [ERROR] (failed to install dependency 'py27-ipython_genutils')
> maintainers: stromnov at macports.org,stromnov at macports.org.
Building 'py27-widgetsnbextension' ... [ERROR] (failed to install dependency 'py27-zmq')
> maintainers: stromnov at macports.org,jrjsmrtn at gmail.com,michaelld at macports.org.
Building 'py27-widgetsnbextension' ... [ERROR] (failed to install dependency 'py27-certifi')
> maintainers: stromnov at macports.org,stromnov at macports.org.
Building 'py27-widgetsnbextension' ... [ERROR] (failed to install dependency 'py27-monotonic')
> maintainers: stromnov at macports.org,stromnov at macports.org.
Building 'py27-widgetsnbextension' ... [ERROR] (failed to install dependency 'py27-html5lib')
> maintainers: stromnov at macports.org.
Building 'py27-widgetsnbextension' ... [ERROR] (failed to install dependency 'py27-mistune')
> maintainers: stromnov at macports.org,stromnov at macports.org.
Building 'py27-widgetsnbextension' ... [ERROR] (failed to install dependency 'py27-jsonschema')
> maintainers: stromnov at macports.org,stromnov at macports.org.
Building 'py27-widgetsnbextension' ... [ERROR] (failed to install dependency 'py27-pandocfilters')
> maintainers: stromnov at macports.org,stromnov at macports.org.
Building 'py27-widgetsnbextension' ... [ERROR] (failed to install dependency 'py27-send2trash')
> maintainers: stromnov at macports.org,stromnov at macports.org.
Building 'py33-sqlalchemy' ... [ERROR]
> maintainers: stromnov at macports.org.
Building 'py-ipywidgets' ... [ERROR] (failed to install dependency 'py27-decorator')
> maintainers: stromnov at macports.org,stromnov at macports.org.
Building 'py-ipywidgets' ... [ERROR] (failed to install dependency 'py27-scandir')
> maintainers: stromnov at macports.org,stromnov at macports.org.
Building 'py-ipywidgets' ... [ERROR] (failed to install dependency 'py27-ptyprocess')
> maintainers: stromnov at macports.org,stromnov at macports.org.
Building 'py-ipywidgets' ... [ERROR] (failed to install dependency 'py27-pygments')
> maintainers: stromnov at macports.org,stromnov at macports.org.
Building 'py-ipywidgets' ... [ERROR] (failed to install dependency 'py27-wcwidth')
> maintainers: stromnov at macports.org,xeron.oskom at gmail.com.
Building 'py-ipywidgets' ... [ERROR] (failed to install dependency 'py27-ipython_genutils')
> maintainers: stromnov at macports.org,stromnov at macports.org.
Building 'py-ipywidgets' ... [ERROR] (failed to install dependency 'py27-zmq')
> maintainers: stromnov at macports.org,jrjsmrtn at gmail.com,michaelld at macports.org.
Building 'py-ipywidgets' ... [ERROR] (failed to install dependency 'py27-certifi')
> maintainers: stromnov at macports.org,stromnov at macports.org.
Building 'py-ipywidgets' ... [ERROR] (failed to install dependency 'py27-monotonic')
> maintainers: stromnov at macports.org,stromnov at macports.org.
Building 'py-ipywidgets' ... [ERROR] (failed to install dependency 'py27-html5lib')
> maintainers: stromnov at macports.org.
Building 'py-ipywidgets' ... [ERROR] (failed to install dependency 'py27-mistune')
> maintainers: stromnov at macports.org,stromnov at macports.org.
Building 'py-ipywidgets' ... [ERROR] (failed to install dependency 'py27-jsonschema')
> maintainers: stromnov at macports.org,stromnov at macports.org.
Building 'py-ipywidgets' ... [ERROR] (failed to install dependency 'py27-pandocfilters')
> maintainers: stromnov at macports.org,stromnov at macports.org.
Building 'py-ipywidgets' ... [ERROR] (failed to install dependency 'py27-send2trash')
> maintainers: stromnov at macports.org,stromnov at macports.org.
Building 'py34-astroid' ... [ERROR]
> maintainers: stromnov at macports.org.
Building 'py34-certifi' ... [ERROR]
> maintainers: stromnov at macports.org.
Building 'py34-ipywidgets' ... [ERROR] (failed to install dependency 'py34-decorator')
> maintainers: stromnov at macports.org,stromnov at macports.org.
Building 'py34-ipywidgets' ... [ERROR] (failed to install dependency 'py34-ptyprocess')
> maintainers: stromnov at macports.org,stromnov at macports.org.
Building 'py34-ipywidgets' ... [ERROR] (failed to install dependency 'py34-wcwidth')
> maintainers: stromnov at macports.org,xeron.oskom at gmail.com.
Building 'py34-ipywidgets' ... [ERROR] (failed to install dependency 'py34-ipython_genutils')
> maintainers: stromnov at macports.org,stromnov at macports.org.
Building 'py34-ipywidgets' ... [ERROR] (failed to install dependency 'py34-zmq')
> maintainers: stromnov at macports.org,jrjsmrtn at gmail.com,michaelld at macports.org.
Building 'py34-ipywidgets' ... [ERROR] (failed to install dependency 'py34-tornado')
> maintainers: stromnov at macports.org,stromnov at macports.org.
Building 'py34-ipywidgets' ... [ERROR] (failed to install dependency 'py34-html5lib')
> maintainers: stromnov at macports.org.
Building 'py34-ipywidgets' ... [ERROR] (failed to install dependency 'py34-mistune')
> maintainers: stromnov at macports.org,stromnov at macports.org.
Building 'py34-ipywidgets' ... [ERROR] (failed to install dependency 'py34-jsonschema')
> maintainers: stromnov at macports.org,stromnov at macports.org.
Building 'py34-ipywidgets' ... [ERROR] (failed to install dependency 'py34-pandocfilters')
> maintainers: stromnov at macports.org,stromnov at macports.org.
Building 'py34-ipywidgets' ... [ERROR] (failed to install dependency 'py34-send2trash')
> maintainers: stromnov at macports.org,stromnov at macports.org.
Building 'py27-astroid' ... [ERROR]
> maintainers: stromnov at macports.org.
Building 'py-widgetsnbextension' ... [ERROR] (failed to install dependency 'py27-decorator')
> maintainers: stromnov at macports.org,stromnov at macports.org.
Building 'py-widgetsnbextension' ... [ERROR] (failed to install dependency 'py27-scandir')
> maintainers: stromnov at macports.org,stromnov at macports.org.
Building 'py-widgetsnbextension' ... [ERROR] (failed to install dependency 'py27-ptyprocess')
> maintainers: stromnov at macports.org,stromnov at macports.org.
Building 'py-widgetsnbextension' ... [ERROR] (failed to install dependency 'py27-pygments')
> maintainers: stromnov at macports.org,stromnov at macports.org.
Building 'py-widgetsnbextension' ... [ERROR] (failed to install dependency 'py27-wcwidth')
> maintainers: stromnov at macports.org,xeron.oskom at gmail.com.
Building 'py-widgetsnbextension' ... [ERROR] (failed to install dependency 'py27-ipython_genutils')
> maintainers: stromnov at macports.org,stromnov at macports.org.
Building 'py-widgetsnbextension' ... [ERROR] (failed to install dependency 'py27-zmq')
> maintainers: stromnov at macports.org,jrjsmrtn at gmail.com,michaelld at macports.org.
Building 'py-widgetsnbextension' ... [ERROR] (failed to install dependency 'py27-certifi')
> maintainers: stromnov at macports.org,stromnov at macports.org.
Building 'py-widgetsnbextension' ... [ERROR] (failed to install dependency 'py27-monotonic')
> maintainers: stromnov at macports.org,stromnov at macports.org.
Building 'py-widgetsnbextension' ... [ERROR] (failed to install dependency 'py27-html5lib')
> maintainers: stromnov at macports.org.
Building 'py-widgetsnbextension' ... [ERROR] (failed to install dependency 'py27-mistune')
> maintainers: stromnov at macports.org,stromnov at macports.org.
Building 'py-widgetsnbextension' ... [ERROR] (failed to install dependency 'py27-jsonschema')
> maintainers: stromnov at macports.org,stromnov at macports.org.
Building 'py-widgetsnbextension' ... [ERROR] (failed to install dependency 'py27-pandocfilters')
> maintainers: stromnov at macports.org,stromnov at macports.org.
Building 'py-widgetsnbextension' ... [ERROR] (failed to install dependency 'py27-send2trash')
> maintainers: stromnov at macports.org,stromnov at macports.org.
Building 'py26-sqlalchemy' ... [ERROR]
> maintainers: stromnov at macports.org.
Building 'py34-pylint' ... [ERROR] (failed to install dependency 'py34-astroid')
> maintainers: blair at macports.org,stromnov at macports.org,stromnov at macports.org.
Building 'py-setuptools_scm' ... [ERROR] (failed to install dependency 'py27-setuptools_scm')
> maintainers: stromnov at macports.org,stromnov at macports.org.
Building 'py34-jupyter_client' ... [ERROR] (failed to install dependency 'py34-decorator')
> maintainers: stromnov at macports.org,stromnov at macports.org.
Building 'py34-jupyter_client' ... [ERROR] (failed to install dependency 'py34-ipython_genutils')
> maintainers: stromnov at macports.org,stromnov at macports.org.
Building 'py34-jupyter_client' ... [ERROR] (failed to install dependency 'py34-zmq')
> maintainers: stromnov at macports.org,jrjsmrtn at gmail.com,michaelld at macports.org.
Building 'py34-setuptools_scm' ... [ERROR]
> maintainers: stromnov at macports.org.
Building 'py27-setuptools_scm' ... [ERROR]
> maintainers: stromnov at macports.org.
Building 'py34-sqlalchemy' ... [ERROR]
> maintainers: stromnov at macports.org.
Building 'py35-astroid' ... [ERROR]
> maintainers: stromnov at macports.org.
Building 'py34-widgetsnbextension' ... [ERROR] (failed to install dependency 'py34-decorator')
> maintainers: stromnov at macports.org,stromnov at macports.org.
Building 'py34-widgetsnbextension' ... [ERROR] (failed to install dependency 'py34-ptyprocess')
> maintainers: stromnov at macports.org,stromnov at macports.org.
Building 'py34-widgetsnbextension' ... [ERROR] (failed to install dependency 'py34-wcwidth')
> maintainers: stromnov at macports.org,xeron.oskom at gmail.com.
Building 'py34-widgetsnbextension' ... [ERROR] (failed to install dependency 'py34-ipython_genutils')
> maintainers: stromnov at macports.org,stromnov at macports.org.
Building 'py34-widgetsnbextension' ... [ERROR] (failed to install dependency 'py34-zmq')
> maintainers: stromnov at macports.org,jrjsmrtn at gmail.com,michaelld at macports.org.
Building 'py34-widgetsnbextension' ... [ERROR] (failed to install dependency 'py34-tornado')
> maintainers: stromnov at macports.org,stromnov at macports.org.
Building 'py34-widgetsnbextension' ... [ERROR] (failed to install dependency 'py34-html5lib')
> maintainers: stromnov at macports.org.
Building 'py34-widgetsnbextension' ... [ERROR] (failed to install dependency 'py34-mistune')
> maintainers: stromnov at macports.org,stromnov at macports.org.
Building 'py34-widgetsnbextension' ... [ERROR] (failed to install dependency 'py34-jsonschema')
> maintainers: stromnov at macports.org,stromnov at macports.org.
Building 'py34-widgetsnbextension' ... [ERROR] (failed to install dependency 'py34-pandocfilters')
> maintainers: stromnov at macports.org,stromnov at macports.org.
Building 'py34-widgetsnbextension' ... [ERROR] (failed to install dependency 'py34-send2trash')
> maintainers: stromnov at macports.org,stromnov at macports.org.
Building 'py35-certifi' ... [ERROR]
> maintainers: stromnov at macports.org.
Building 'py26-certifi' ... [ERROR]
> maintainers: stromnov at macports.org.
Building 'py35-ipywidgets' ... [ERROR] (failed to install dependency 'py35-decorator')
> maintainers: stromnov at macports.org,stromnov at macports.org.
Building 'py35-ipywidgets' ... [ERROR] (failed to install dependency 'py35-ptyprocess')
> maintainers: stromnov at macports.org,stromnov at macports.org.
Building 'py35-ipywidgets' ... [ERROR] (failed to install dependency 'py35-wcwidth')
> maintainers: stromnov at macports.org,xeron.oskom at gmail.com.
Building 'py35-ipywidgets' ... [ERROR] (failed to install dependency 'py35-ipython_genutils')
> maintainers: stromnov at macports.org,stromnov at macports.org.
Building 'py35-ipywidgets' ... [ERROR] (failed to install dependency 'py35-zmq')
> maintainers: stromnov at macports.org,jrjsmrtn at gmail.com,michaelld at macports.org.
Building 'py35-ipywidgets' ... [ERROR] (failed to install dependency 'py35-tornado')
> maintainers: stromnov at macports.org,stromnov at macports.org.
Building 'py35-ipywidgets' ... [ERROR] (failed to install dependency 'py35-html5lib')
> maintainers: stromnov at macports.org.
Building 'py35-ipywidgets' ... [ERROR] (failed to install dependency 'py35-mistune')
> maintainers: stromnov at macports.org,stromnov at macports.org.
Building 'py35-ipywidgets' ... [ERROR] (failed to install dependency 'py35-jsonschema')
> maintainers: stromnov at macports.org,stromnov at macports.org.
Building 'py35-ipywidgets' ... [ERROR] (failed to install dependency 'py35-pandocfilters')
> maintainers: stromnov at macports.org,stromnov at macports.org.
Building 'py35-ipywidgets' ... [ERROR] (failed to install dependency 'py35-send2trash')
> maintainers: stromnov at macports.org,stromnov at macports.org.
Building 'py35-jupyter_client' ... [ERROR] (failed to install dependency 'py35-decorator')
> maintainers: stromnov at macports.org,stromnov at macports.org.
Building 'py35-jupyter_client' ... [ERROR] (failed to install dependency 'py35-ipython_genutils')
> maintainers: stromnov at macports.org,stromnov at macports.org.
Building 'py35-jupyter_client' ... [ERROR] (failed to install dependency 'py35-zmq')
> maintainers: stromnov at macports.org,jrjsmrtn at gmail.com,michaelld at macports.org.
Building 'py35-pylint' ... [ERROR] (failed to install dependency 'py35-astroid')
> maintainers: blair at macports.org,stromnov at macports.org,stromnov at macports.org.
Building 'py35-sqlalchemy' ... [ERROR]
> maintainers: stromnov at macports.org.
Building 'py35-widgetsnbextension' ... [ERROR] (failed to install dependency 'py35-decorator')
> maintainers: stromnov at macports.org,stromnov at macports.org.
Building 'py35-widgetsnbextension' ... [ERROR] (failed to install dependency 'py35-ptyprocess')
> maintainers: stromnov at macports.org,stromnov at macports.org.
Building 'py35-widgetsnbextension' ... [ERROR] (failed to install dependency 'py35-wcwidth')
> maintainers: stromnov at macports.org,xeron.oskom at gmail.com.
Building 'py35-widgetsnbextension' ... [ERROR] (failed to install dependency 'py35-ipython_genutils')
> maintainers: stromnov at macports.org,stromnov at macports.org.
Building 'py35-widgetsnbextension' ... [ERROR] (failed to install dependency 'py35-zmq')
> maintainers: stromnov at macports.org,jrjsmrtn at gmail.com,michaelld at macports.org.
Building 'py35-widgetsnbextension' ... [ERROR] (failed to install dependency 'py35-tornado')
> maintainers: stromnov at macports.org,stromnov at macports.org.
Building 'py35-widgetsnbextension' ... [ERROR] (failed to install dependency 'py35-html5lib')
> maintainers: stromnov at macports.org.
Building 'py35-widgetsnbextension' ... [ERROR] (failed to install dependency 'py35-mistune')
> maintainers: stromnov at macports.org,stromnov at macports.org.
Building 'py35-widgetsnbextension' ... [ERROR] (failed to install dependency 'py35-jsonschema')
> maintainers: stromnov at macports.org,stromnov at macports.org.
Building 'py35-widgetsnbextension' ... [ERROR] (failed to install dependency 'py35-pandocfilters')
> maintainers: stromnov at macports.org,stromnov at macports.org.
Building 'py35-widgetsnbextension' ... [ERROR] (failed to install dependency 'py35-send2trash')
> maintainers: stromnov at macports.org,stromnov at macports.org.
Building 'py36-astroid' ... [ERROR]
> maintainers: stromnov at macports.org.
Building 'py36-certifi' ... [ERROR]
> maintainers: stromnov at macports.org.
Building 'py36-jupyter_client' ... [ERROR] (failed to install dependency 'py36-decorator')
> maintainers: stromnov at macports.org,stromnov at macports.org.
Building 'py36-jupyter_client' ... [ERROR] (failed to install dependency 'py36-ipython_genutils')
> maintainers: stromnov at macports.org,stromnov at macports.org.
Building 'py36-jupyter_client' ... [ERROR] (failed to install dependency 'py36-zmq')
> maintainers: stromnov at macports.org,jrjsmrtn at gmail.com,michaelld at macports.org.
Building 'py36-ipywidgets' ... [ERROR] (failed to install dependency 'py36-decorator')
> maintainers: stromnov at macports.org,stromnov at macports.org.
Building 'py36-ipywidgets' ... [ERROR] (failed to install dependency 'py36-ptyprocess')
> maintainers: stromnov at macports.org,stromnov at macports.org.
Building 'py36-ipywidgets' ... [ERROR] (failed to install dependency 'py36-pygments')
> maintainers: stromnov at macports.org,stromnov at macports.org.
Building 'py36-ipywidgets' ... [ERROR] (failed to install dependency 'py36-wcwidth')
> maintainers: stromnov at macports.org,xeron.oskom at gmail.com.
Building 'py36-ipywidgets' ... [ERROR] (failed to install dependency 'py36-ipython_genutils')
> maintainers: stromnov at macports.org,stromnov at macports.org.
Building 'py36-ipywidgets' ... [ERROR] (failed to install dependency 'py36-zmq')
> maintainers: stromnov at macports.org,jrjsmrtn at gmail.com,michaelld at macports.org.
Building 'py36-ipywidgets' ... [ERROR] (failed to install dependency 'py36-tornado')
> maintainers: stromnov at macports.org,stromnov at macports.org.
Building 'py36-ipywidgets' ... [ERROR] (failed to install dependency 'py36-html5lib')
> maintainers: stromnov at macports.org.
Building 'py36-ipywidgets' ... [ERROR] (failed to install dependency 'py36-mistune')
> maintainers: stromnov at macports.org,stromnov at macports.org.
Building 'py36-ipywidgets' ... [ERROR] (failed to install dependency 'py36-jsonschema')
> maintainers: stromnov at macports.org,stromnov at macports.org.
Building 'py36-ipywidgets' ... [ERROR] (failed to install dependency 'py36-pandocfilters')
> maintainers: stromnov at macports.org,stromnov at macports.org.
Building 'py36-ipywidgets' ... [ERROR] (failed to install dependency 'py36-send2trash')
> maintainers: stromnov at macports.org,stromnov at macports.org.
Building 'py36-pylint' ... [ERROR] (failed to install dependency 'py36-astroid')
> maintainers: blair at macports.org,stromnov at macports.org,stromnov at macports.org.
Building 'py36-widgetsnbextension' ... [ERROR] (failed to install dependency 'py36-decorator')
> maintainers: stromnov at macports.org,stromnov at macports.org.
Building 'py36-widgetsnbextension' ... [ERROR] (failed to install dependency 'py36-ptyprocess')
> maintainers: stromnov at macports.org,stromnov at macports.org.
Building 'py36-widgetsnbextension' ... [ERROR] (failed to install dependency 'py36-pygments')
> maintainers: stromnov at macports.org,stromnov at macports.org.
Building 'py36-widgetsnbextension' ... [ERROR] (failed to install dependency 'py36-wcwidth')
> maintainers: stromnov at macports.org,xeron.oskom at gmail.com.
Building 'py36-widgetsnbextension' ... [ERROR] (failed to install dependency 'py36-ipython_genutils')
> maintainers: stromnov at macports.org,stromnov at macports.org.
Building 'py36-widgetsnbextension' ... [ERROR] (failed to install dependency 'py36-zmq')
> maintainers: stromnov at macports.org,jrjsmrtn at gmail.com,michaelld at macports.org.
Building 'py36-widgetsnbextension' ... [ERROR] (failed to install dependency 'py36-tornado')
> maintainers: stromnov at macports.org,stromnov at macports.org.
Building 'py36-widgetsnbextension' ... [ERROR] (failed to install dependency 'py36-html5lib')
> maintainers: stromnov at macports.org.
Building 'py36-widgetsnbextension' ... [ERROR] (failed to install dependency 'py36-mistune')
> maintainers: stromnov at macports.org,stromnov at macports.org.
Building 'py36-widgetsnbextension' ... [ERROR] (failed to install dependency 'py36-jsonschema')
> maintainers: stromnov at macports.org,stromnov at macports.org.
Building 'py36-widgetsnbextension' ... [ERROR] (failed to install dependency 'py36-pandocfilters')
> maintainers: stromnov at macports.org,stromnov at macports.org.
Building 'py36-widgetsnbextension' ... [ERROR] (failed to install dependency 'py36-send2trash')
> maintainers: stromnov at macports.org,stromnov at macports.org.
Building 'py36-sqlalchemy' ... [ERROR]
> maintainers: stromnov at macports.org.
Broken ports:
- py-astroid
- py-certifi
- py-ipywidgets
- py-jupyter_client
- py-pylint
- py-setuptools_scm
- py-sqlalchemy
- py-widgetsnbextension
- py26-certifi
- py26-sqlalchemy
- py27-astroid
- py27-certifi
- py27-decorator
- py27-html5lib
- py27-ipython_genutils
- py27-ipywidgets
- py27-jsonschema
- py27-jupyter_client
- py27-mistune
- py27-monotonic
- py27-pandocfilters
- py27-ptyprocess
- py27-pygments
- py27-pylint
- py27-scandir
- py27-send2trash
- py27-setuptools_scm
- py27-sqlalchemy
- py27-wcwidth
- py27-widgetsnbextension
- py27-zmq
- py33-certifi
- py33-sqlalchemy
- py34-astroid
- py34-certifi
- py34-decorator
- py34-html5lib
- py34-ipython_genutils
- py34-ipywidgets
- py34-jsonschema
- py34-jupyter_client
- py34-mistune
- py34-pandocfilters
- py34-ptyprocess
- py34-pylint
- py34-send2trash
- py34-setuptools_scm
- py34-sqlalchemy
- py34-tornado
- py34-wcwidth
- py34-widgetsnbextension
- py34-zmq
- py35-astroid
- py35-certifi
- py35-decorator
- py35-html5lib
- py35-ipython_genutils
- py35-ipywidgets
- py35-jsonschema
- py35-jupyter_client
- py35-mistune
- py35-pandocfilters
- py35-ptyprocess
- py35-pylint
- py35-send2trash
- py35-sqlalchemy
- py35-tornado
- py35-wcwidth
- py35-widgetsnbextension
- py35-zmq
- py36-astroid
- py36-certifi
- py36-decorator
- py36-html5lib
- py36-ipython_genutils
- py36-ipywidgets
- py36-jsonschema
- py36-jupyter_client
- py36-mistune
- py36-pandocfilters
- py36-ptyprocess
- py36-pygments
- py36-pylint
- py36-send2trash
- py36-sqlalchemy
- py36-tornado
- py36-wcwidth
- py36-widgetsnbextension
- py36-zmq
Responsible maintainers:
- blair at macports.org
- jrjsmrtn at gmail.com
- michaelld at macports.org
- stromnov at macports.org
- xeron.oskom at gmail.com
Links to individual build jobs:
- ports-10.5_ppc_legacy-builder #53003
https://build.macports.org/builders/ports-10.5_ppc_legacy-builder/builds/53003
- ports-10.5_ppc_legacy-builder #53004
https://build.macports.org/builders/ports-10.5_ppc_legacy-builder/builds/53004
- ports-10.5_ppc_legacy-builder #53005
https://build.macports.org/builders/ports-10.5_ppc_legacy-builder/builds/53005
- ports-10.5_ppc_legacy-builder #53006
https://build.macports.org/builders/ports-10.5_ppc_legacy-builder/builds/53006
- ports-10.5_ppc_legacy-builder #53007
https://build.macports.org/builders/ports-10.5_ppc_legacy-builder/builds/53007
- ports-10.5_ppc_legacy-builder #53008
https://build.macports.org/builders/ports-10.5_ppc_legacy-builder/builds/53008
- ports-10.5_ppc_legacy-builder #53009
https://build.macports.org/builders/ports-10.5_ppc_legacy-builder/builds/53009
- ports-10.5_ppc_legacy-builder #53010
https://build.macports.org/builders/ports-10.5_ppc_legacy-builder/builds/53010
- ports-10.5_ppc_legacy-builder #53011
https://build.macports.org/builders/ports-10.5_ppc_legacy-builder/builds/53011
- ports-10.5_ppc_legacy-builder #53012
https://build.macports.org/builders/ports-10.5_ppc_legacy-builder/builds/53012
- ports-10.5_ppc_legacy-builder #53013
https://build.macports.org/builders/ports-10.5_ppc_legacy-builder/builds/53013
- ports-10.5_ppc_legacy-builder #53014
https://build.macports.org/builders/ports-10.5_ppc_legacy-builder/builds/53014
- ports-10.5_ppc_legacy-builder #53015
https://build.macports.org/builders/ports-10.5_ppc_legacy-builder/builds/53015
- ports-10.5_ppc_legacy-builder #53016
https://build.macports.org/builders/ports-10.5_ppc_legacy-builder/builds/53016
- ports-10.5_ppc_legacy-builder #53017
https://build.macports.org/builders/ports-10.5_ppc_legacy-builder/builds/53017
- ports-10.5_ppc_legacy-builder #53018
https://build.macports.org/builders/ports-10.5_ppc_legacy-builder/builds/53018
- ports-10.5_ppc_legacy-builder #53019
https://build.macports.org/builders/ports-10.5_ppc_legacy-builder/builds/53019
- ports-10.5_ppc_legacy-builder #53020
https://build.macports.org/builders/ports-10.5_ppc_legacy-builder/builds/53020
- ports-10.5_ppc_legacy-builder #53021
https://build.macports.org/builders/ports-10.5_ppc_legacy-builder/builds/53021
- ports-10.5_ppc_legacy-builder #53022
https://build.macports.org/builders/ports-10.5_ppc_legacy-builder/builds/53022
- ports-10.5_ppc_legacy-builder #53023
https://build.macports.org/builders/ports-10.5_ppc_legacy-builder/builds/53023
- ports-10.5_ppc_legacy-builder #53024
https://build.macports.org/builders/ports-10.5_ppc_legacy-builder/builds/53024
- ports-10.5_ppc_legacy-builder #53025
https://build.macports.org/builders/ports-10.5_ppc_legacy-builder/builds/53025
- ports-10.5_ppc_legacy-builder #53026
https://build.macports.org/builders/ports-10.5_ppc_legacy-builder/builds/53026
- ports-10.5_ppc_legacy-builder #53027
https://build.macports.org/builders/ports-10.5_ppc_legacy-builder/builds/53027
- ports-10.5_ppc_legacy-builder #53028
https://build.macports.org/builders/ports-10.5_ppc_legacy-builder/builds/53028
- ports-10.5_ppc_legacy-builder #53029
https://build.macports.org/builders/ports-10.5_ppc_legacy-builder/builds/53029
- ports-10.5_ppc_legacy-builder #53030
https://build.macports.org/builders/ports-10.5_ppc_legacy-builder/builds/53030
- ports-10.5_ppc_legacy-builder #53031
https://build.macports.org/builders/ports-10.5_ppc_legacy-builder/builds/53031
- ports-10.5_ppc_legacy-builder #53032
https://build.macports.org/builders/ports-10.5_ppc_legacy-builder/builds/53032
- ports-10.5_ppc_legacy-builder #53033
https://build.macports.org/builders/ports-10.5_ppc_legacy-builder/builds/53033
- ports-10.5_ppc_legacy-builder #53034
https://build.macports.org/builders/ports-10.5_ppc_legacy-builder/builds/53034
- ports-10.5_ppc_legacy-builder #53035
https://build.macports.org/builders/ports-10.5_ppc_legacy-builder/builds/53035
- ports-10.5_ppc_legacy-builder #53036
https://build.macports.org/builders/ports-10.5_ppc_legacy-builder/builds/53036
- ports-10.5_ppc_legacy-builder #53037
https://build.macports.org/builders/ports-10.5_ppc_legacy-builder/builds/53037
- ports-10.5_ppc_legacy-builder #53038
https://build.macports.org/builders/ports-10.5_ppc_legacy-builder/builds/53038
- ports-10.5_ppc_legacy-builder #53039
https://build.macports.org/builders/ports-10.5_ppc_legacy-builder/builds/53039
- ports-10.5_ppc_legacy-builder #53040
https://build.macports.org/builders/ports-10.5_ppc_legacy-builder/builds/53040
- ports-10.5_ppc_legacy-builder #53041
https://build.macports.org/builders/ports-10.5_ppc_legacy-builder/builds/53041
- ports-10.5_ppc_legacy-builder #53042
https://build.macports.org/builders/ports-10.5_ppc_legacy-builder/builds/53042
- ports-10.5_ppc_legacy-builder #53043
https://build.macports.org/builders/ports-10.5_ppc_legacy-builder/builds/53043
- ports-10.5_ppc_legacy-builder #53044
https://build.macports.org/builders/ports-10.5_ppc_legacy-builder/builds/53044
- ports-10.5_ppc_legacy-builder #53045
https://build.macports.org/builders/ports-10.5_ppc_legacy-builder/builds/53045
- ports-10.5_ppc_legacy-builder #53046
https://build.macports.org/builders/ports-10.5_ppc_legacy-builder/builds/53046
--
Best regards,
MacPorts Buildbot
https://build.macports.org/
More information about the macports-builds
mailing list