Build Failure on ports-10.7_x86_64_legacy: faust, faust-devel, faustlive-devel

buildbot at buildbot at
Thu Nov 1 02:12:27 UTC 2018

Status:       Failure
Build slave:  ports-10.7_x86_64_legacy
Full logs:
Build reason: The SingleBranchScheduler scheduler named 'ports' triggered this build
Port list:    faustlive-devel faust-devel faust
Subport list:
	- faust
	- faust-devel
	- faustlive-devel
Variants:     None
Revision:     edb180de87865fa77cabc610028536e17e1f0a87
Build time:   0:21:48
Author:       Albert Gräf <aggraef at>

Log from failed builds:
	Building 'faust-devel' ... [ERROR]
	> maintainers: ryandesign at,aggraef at
	Building 'faust' ... [ERROR]
	> maintainers: ryandesign at,aggraef at
	Building 'faustlive-devel' ... [ERROR] (failed to install dependency 'faust-devel')
	> maintainers: ryandesign at,aggraef at,ryandesign at,aggraef at

Broken ports:
	- faust
	- faust-devel
	- faustlive-devel

Responsible maintainers:
	- aggraef at
	- ryandesign at

Links to individual build jobs:
- ports-10.7_x86_64_legacy-builder #84434
- ports-10.7_x86_64_legacy-builder #84435
- ports-10.7_x86_64_legacy-builder #84436

Best regards,
MacPorts Buildbot

More information about the macports-builds mailing list