Build Failure on ports-10.13_x86_64: hs-type-level, hs-typenats, hs-vty

buildbot at buildbot at
Fri Nov 2 00:34:29 UTC 2018

Status:       Failure
Build slave:  ports-10.13_x86_64
Full logs:
Build reason: A build was forced by 'ryandesign <ryandesign at localhost>': force build
Port list:    hs-time-compat hs-tls hs-vector-space hs-zlib-bindings hs-void hs-yaml hs-xml hs-type-level hs-utf8-string hs-utility-ht hs-tls-extra hs-zip-archive hs-vty hs-typenats hs-uniplate hs-transformers-base
Subport list:
	- hs-type-level
	- hs-typenats
	- hs-vty
Variants:     None
Build time:   0:15:53

Log from failed builds:
	Building 'hs-typenats' ... [ERROR]
	> maintainers: .
	Building 'hs-type-level' ... [ERROR]
	> maintainers: cal at
	Building 'hs-vty' ... [ERROR]
	> maintainers: cal at

Broken ports:
	- hs-type-level
	- hs-typenats
	- hs-vty

Responsible maintainers:
	- cal at

Links to individual build jobs:
- ports-10.13_x86_64-builder #41178
- ports-10.13_x86_64-builder #41179
- ports-10.13_x86_64-builder #41180

Best regards,
MacPorts Buildbot

More information about the macports-builds mailing list