Build Failure on ports-10.6_x86_64: p5.26-test2-harness, p5.28-test2-harness, p5.30-test2-harness

buildbot at buildbot at
Sun Mar 8 01:02:22 UTC 2020

Status:       Failure
Build slave:  ports-10.6_x86_64
Full logs:
Build reason: The SingleBranchScheduler scheduler named 'ports' triggered this build
Port list:    p5-test2-harness
Subport list:
	- p5.26-test2-harness
	- p5.28-test2-harness
	- p5.30-test2-harness
Variants:     None
Revision:     c92fab3b7e7ca511d64c88f7ffd430caa64bc8ef
Build time:   0:17:39
Author:       David B. Evans <devans at>

Log from failed builds:
	Building 'p5.26-test2-harness' ... [ERROR]
	> maintainers: devans at
	Building 'p5.28-test2-harness' ... [ERROR]
	> maintainers: devans at
	Building 'p5.30-test2-harness' ... [ERROR]
	> maintainers: devans at

Broken ports:
	- p5.26-test2-harness
	- p5.28-test2-harness
	- p5.30-test2-harness

Responsible maintainers:
	- devans at

Links to individual build jobs:
- ports-10.6_x86_64-builder #21738
- ports-10.6_x86_64-builder #21739
- ports-10.6_x86_64-builder #21740

Best regards,
MacPorts Buildbot

More information about the macports-builds mailing list