[MacPorts] #24247: Cannot install erlang on leopard

MacPorts noreply at macports.org
Wed Apr 14 21:34:00 PDT 2010

#24247: Cannot install erlang on leopard
 Reporter:  denro03@…          |       Owner:  bfulgham@…           
     Type:  defect             |      Status:  new                  
 Priority:  Normal             |   Milestone:                       
Component:  ports              |     Version:  1.8.2                
 Keywords:                     |        Port:  erlang               

Comment(by trog24@…):

 The follower error occurred during:
 sudo port -d upgrade installed

 === Entering application wx
 make[3]: Nothing to be done for `opt'.
 mkdir -p ../priv/powerpc-apple-darwin9.8.0
 /usr/bin/g++-4.0 -bundle -flat_namespace -undefined warning -fPIC
 -framework OpenGL -L/opt/local/lib  powerpc-apple-darwin9.8.0/wxe_driver.o
 powerpc-apple-darwin9.8.0/wxe_ps_init.o powerpc-apple-
 darwin9.8.0/wxe_impl.o powerpc-apple-darwin9.8.0/wxePrintout.o powerpc-
 apple-darwin9.8.0/wxe_return.o  powerpc-apple-darwin9.8.0/wxe_funcs.o
 powerpc-apple-darwin9.8.0/wxe_events.o powerpc-apple-
 darwin9.8.0/wxe_init.o powerpc-apple-darwin9.8.0/gl_funcs.o powerpc-apple-
 darwin9.8.0/wxe_gl.o  -L/opt/local/lib   -L/opt/local/lib -L/opt/local/lib
 -framework IOKit -framework Carbon -framework Cocoa -framework System
 -framework QuickTime -framework OpenGL -framework AGL  -lwx_macu_stc-2.8
 -lwx_macu_gl-2.8 -lwx_macu-2.8  -o ../priv/powerpc-apple-
 ld: file not found: /opt/local/lib/libjpeg.7.dylib
 collect2: ld returned 1 exit status
 make[3]: *** [../priv/powerpc-apple-darwin9.8.0/wxe_driver.so] Error 1
 make[2]: *** [opt] Error 2
 make[1]: *** [opt] Error 2
 make: *** [libs] Error 2
 Error: Target org.macports.build returned: shell command " cd
 /erlang-R13B04" && /usr/bin/make all " returned error 2
 DEBUG: Backtrace: shell command " cd
 /erlang-R13B04" && /usr/bin/make all " returned error 2
     while executing
 "command_exec build"
     (procedure "portbuild::build_main" line 9)
     invoked from within
 "$procedure $targetname"
 Warning: the following items did not execute (for erlang):
 org.macports.destroot org.macports.build
 DEBUG: Registry error: kaffe not registered as installed & active.
     while executing
 "registry::active $portname"
 Error: Unable to upgrade port: 1
 To report a bug, see <http://guide.macports.org/#project.tickets>

 The original error occurred running:
 sudo port upgrade installed
 before running with debug enabled.

Ticket URL: <http://trac.macports.org/ticket/24247#comment:3>
MacPorts <http://www.macports.org/>
Ports system for Mac OS

More information about the macports-tickets mailing list