[MacPorts] #25448: freepops 0.0.18 fails to build on OS X 10.6.4
MacPorts
noreply at macports.org
Sun Jun 27 16:03:00 PDT 2010
#25448: freepops 0.0.18 fails to build on OS X 10.6.4
--------------------------------+-------------------------------------------
Reporter: gjznituv@… | Owner: macports-tickets@…
Type: defect | Status: new
Priority: Normal | Milestone:
Component: ports | Version: 1.9.0
Keywords: | Port: freepops
--------------------------------+-------------------------------------------
{{{
---> Building freepops
Error: Target org.macports.build returned: shell command failed
Log for freepops is at:
/opt/local/var/macports/logs/_opt_local_var_macports_sources_rsync.macports.org_release_ports_mail_freepops/main.log
Error: Status 1 encountered during processing.
To report a bug, see <http://guide.macports.org/#project.tickets>
~/ cat
/opt/local/var/macports/logs/_opt_local_var_macports_sources_rsync.macports.org_release_ports_mail_freepops/main.log
version:1
:debug:main epoch: in tree: 0 installed: 0
:debug:main curl 7.21.0_0 exists in the ports tree
:debug:main curl 7.20.0_0 +ssl is the latest installed
:debug:main curl 7.20.0_0 +ssl is active
:debug:main Merging existing variants '+ssl' into variants
:debug:main new fully merged portvariants: ssl +
:debug:main Changing to port directory:
/opt/local/var/macports/sources/rsync.macports.org/release/ports/net/curl
:debug:main OS darwin/10.3.0 (Mac OS X 10.6) arch i386
:debug:main org.macports.load registered provides 'load', a pre-existing
procedure. Target override will not be provided
:debug:main org.macports.unload registered provides 'unload', a pre-
existing procedure. Target override will not be provided
:debug:main org.macports.distfiles registered provides 'distfiles', a pre-
existing procedure. Target override will not be provided
:debug:main Using group file
/opt/local/var/macports/sources/rsync.macports.org/release/ports/_resources/port1.0/group/muniversal-1.0.tcl
:debug:main Reading variant descriptions from
/opt/local/var/macports/sources/rsync.macports.org/release/ports/_resources/port1.0/variant_descriptions.conf
:debug:main Using group file
/opt/local/var/macports/sources/rsync.macports.org/release/ports/_resources/port1.0/group/archcheck-1.0.tcl
:debug:main universal variant already exists, so not adding the default
one
:debug:main Executing variant ssl provides ssl
:debug:main epoch: in tree: 0 installed: 0
:debug:main pkgconfig 0.25_0 exists in the ports tree
:debug:main pkgconfig 0.25_0 +universal is the latest installed
:debug:main pkgconfig 0.25_0 +universal is active
:debug:main Merging existing variants '+universal' into variants
:debug:main new fully merged portvariants: universal +
:debug:main Changing to port directory:
/opt/local/var/macports/sources/rsync.macports.org/release/ports/devel/pkgconfig
:debug:main OS darwin/10.3.0 (Mac OS X 10.6) arch i386
:debug:main org.macports.load registered provides 'load', a pre-existing
procedure. Target override will not be provided
:debug:main org.macports.unload registered provides 'unload', a pre-
existing procedure. Target override will not be provided
:debug:main org.macports.distfiles registered provides 'distfiles', a pre-
existing procedure. Target override will not be provided
:debug:main adding the default universal variant
:debug:main Reading variant descriptions from
/opt/local/var/macports/sources/rsync.macports.org/release/ports/_resources/port1.0/variant_descriptions.conf
:debug:main Executing variant universal provides universal
:debug:main No need to upgrade! pkgconfig 0.25_0 >= pkgconfig 0.25_0
:debug:main epoch: in tree: 0 installed: 0
:debug:main zlib 1.2.5_0 exists in the ports tree
:debug:main zlib 1.2.5_0 +universal is the latest installed
:debug:main zlib 1.2.5_0 +universal is active
:debug:main Merging existing variants '+universal' into variants
:debug:main new fully merged portvariants: universal +
:debug:main Changing to port directory:
/opt/local/var/macports/sources/rsync.macports.org/release/ports/archivers/zlib
:debug:main OS darwin/10.3.0 (Mac OS X 10.6) arch i386
:debug:main org.macports.load registered provides 'load', a pre-existing
procedure. Target override will not be provided
:debug:main org.macports.unload registered provides 'unload', a pre-
existing procedure. Target override will not be provided
:debug:main org.macports.distfiles registered provides 'distfiles', a pre-
existing procedure. Target override will not be provided
:debug:main Using group file
/opt/local/var/macports/sources/rsync.macports.org/release/ports/_resources/port1.0/group/xcodeversion-1.0.tcl
:debug:main adding the default universal variant
:debug:main Reading variant descriptions from
/opt/local/var/macports/sources/rsync.macports.org/release/ports/_resources/port1.0/variant_descriptions.conf
:debug:main Executing variant universal provides universal
:debug:main No need to upgrade! zlib 1.2.5_0 >= zlib 1.2.5_0
:debug:main epoch: in tree: 0 installed: 0
:debug:main libidn 1.19_0 exists in the ports tree
:debug:main libidn 1.16_0 is the latest installed
:debug:main libidn 1.16_0 is active
:debug:main Merging existing variants '' into variants
:debug:main new fully merged portvariants:
:debug:main Changing to port directory:
/opt/local/var/macports/sources/rsync.macports.org/release/ports/mail/libidn
:debug:main OS darwin/10.3.0 (Mac OS X 10.6) arch i386
:debug:main org.macports.load registered provides 'load', a pre-existing
procedure. Target override will not be provided
:debug:main org.macports.unload registered provides 'unload', a pre-
existing procedure. Target override will not be provided
:debug:main org.macports.distfiles registered provides 'distfiles', a pre-
existing procedure. Target override will not be provided
:debug:main adding the default universal variant
:debug:main Reading variant descriptions from
/opt/local/var/macports/sources/rsync.macports.org/release/ports/_resources/port1.0/variant_descriptions.conf
:debug:main epoch: in tree: 0 installed: 0
:debug:main libiconv 1.13.1_0 exists in the ports tree
:debug:main libiconv 1.13.1_0 is the latest installed
:debug:main libiconv 1.13.1_0 +universal is active
:debug:main Merging existing variants '+universal' into variants
:debug:main new fully merged portvariants: universal +
:debug:main Changing to port directory:
/opt/local/var/macports/sources/rsync.macports.org/release/ports/textproc/libiconv
:debug:main OS darwin/10.3.0 (Mac OS X 10.6) arch i386
:debug:main org.macports.load registered provides 'load', a pre-existing
procedure. Target override will not be provided
:debug:main org.macports.unload registered provides 'unload', a pre-
existing procedure. Target override will not be provided
:debug:main org.macports.distfiles registered provides 'distfiles', a pre-
existing procedure. Target override will not be provided
:debug:main Using group file
/opt/local/var/macports/sources/rsync.macports.org/release/ports/_resources/port1.0/group/muniversal-1.0.tcl
:debug:main Reading variant descriptions from
/opt/local/var/macports/sources/rsync.macports.org/release/ports/_resources/port1.0/variant_descriptions.conf
:debug:main universal variant already exists, so not adding the default
one
:debug:main Executing variant universal provides universal
:debug:main No need to upgrade! libiconv 1.13.1_0 >= libiconv 1.13.1_0
:debug:main epoch: in tree: 0 installed: 0
:debug:main gettext 0.18.1.1_0 exists in the ports tree
:debug:main gettext 0.18.1.1_0 +universal is the latest installed
:debug:main gettext 0.18.1.1_0 +universal is active
:debug:main Merging existing variants '+universal' into variants
:debug:main new fully merged portvariants: universal +
:debug:main Changing to port directory:
/opt/local/var/macports/sources/rsync.macports.org/release/ports/devel/gettext
:debug:main OS darwin/10.3.0 (Mac OS X 10.6) arch i386
:debug:main org.macports.load registered provides 'load', a pre-existing
procedure. Target override will not be provided
:debug:main org.macports.unload registered provides 'unload', a pre-
existing procedure. Target override will not be provided
:debug:main org.macports.distfiles registered provides 'distfiles', a pre-
existing procedure. Target override will not be provided
:debug:main Using group file
/opt/local/var/macports/sources/rsync.macports.org/release/ports/_resources/port1.0/group/muniversal-1.0.tcl
:debug:main Reading variant descriptions from
/opt/local/var/macports/sources/rsync.macports.org/release/ports/_resources/port1.0/variant_descriptions.conf
:debug:main Using group file
/opt/local/var/macports/sources/rsync.macports.org/release/ports/_resources/port1.0/group/archcheck-1.0.tcl
:debug:main universal variant already exists, so not adding the default
one
:debug:main Executing variant universal provides universal
:debug:main No need to upgrade! gettext 0.18.1.1_0 >= gettext 0.18.1.1_0
:debug:main epoch: in tree: 0 installed: 0
:debug:main ncurses 5.7_0 exists in the ports tree
:debug:main ncurses 5.7_0 +darwin_10+universal is the latest installed
:debug:main ncurses 5.7_0 +darwin_10+universal is active
:debug:main Merging existing variants '+darwin_10+universal' into variants
:debug:main new fully merged portvariants: universal + darwin_10 +
:debug:main Changing to port directory:
/opt/local/var/macports/sources/rsync.macports.org/release/ports/devel/ncurses
:debug:main OS darwin/10.3.0 (Mac OS X 10.6) arch i386
:debug:main org.macports.load registered provides 'load', a pre-existing
procedure. Target override will not be provided
:debug:main org.macports.unload registered provides 'unload', a pre-
existing procedure. Target override will not be provided
:debug:main org.macports.distfiles registered provides 'distfiles', a pre-
existing procedure. Target override will not be provided
:debug:main Using group file
/opt/local/var/macports/sources/rsync.macports.org/release/ports/_resources/port1.0/group/muniversal-1.0.tcl
:debug:main Reading variant descriptions from
/opt/local/var/macports/sources/rsync.macports.org/release/ports/_resources/port1.0/variant_descriptions.conf
:debug:main universal variant already exists, so not adding the default
one
:debug:main Requested variant darwin_10 is not provided by port ncurses.
:debug:main Executing variant universal provides universal
:debug:main Skipping upgrade since ncurses 5.7_0 >= ncurses 5.7_0, even
though installed variants "+darwin_10+universal" do not match
"+universal".
:debug:main epoch: in tree: 0 installed: 0
:debug:main ncursesw 5.7_0 exists in the ports tree
:debug:main ncursesw 5.7_0 +darwin_10 is the latest installed
:debug:main ncursesw 5.7_0 +darwin_10+universal is active
:debug:main Merging existing variants '+darwin_10+universal' into variants
:debug:main new fully merged portvariants: universal + darwin_10 +
:debug:main Changing to port directory:
/opt/local/var/macports/sources/rsync.macports.org/release/ports/devel/ncursesw
:debug:main OS darwin/10.3.0 (Mac OS X 10.6) arch i386
:debug:main org.macports.load registered provides 'load', a pre-existing
procedure. Target override will not be provided
:debug:main org.macports.unload registered provides 'unload', a pre-
existing procedure. Target override will not be provided
:debug:main org.macports.distfiles registered provides 'distfiles', a pre-
existing procedure. Target override will not be provided
:debug:main Using group file
/opt/local/var/macports/sources/rsync.macports.org/release/ports/_resources/port1.0/group/muniversal-1.0.tcl
:debug:main Reading variant descriptions from
/opt/local/var/macports/sources/rsync.macports.org/release/ports/_resources/port1.0/variant_descriptions.conf
:debug:main universal variant already exists, so not adding the default
one
:debug:main Requested variant darwin_10 is not provided by port ncursesw.
:debug:main Executing variant universal provides universal
:debug:main Skipping upgrade since ncursesw 5.7_0 >= ncursesw 5.7_0, even
though installed variants "+darwin_10+universal" do not match
"+universal".
:debug:main epoch: in tree: 0 installed: 0
:debug:main expat 2.0.1_0 exists in the ports tree
:debug:main expat 2.0.1_0 is the latest installed
:debug:main expat 2.0.1_0 +universal is active
:debug:main Merging existing variants '+universal' into variants
:debug:main new fully merged portvariants: universal +
:debug:main Changing to port directory:
/opt/local/var/macports/sources/rsync.macports.org/release/ports/textproc/expat
:debug:main OS darwin/10.3.0 (Mac OS X 10.6) arch i386
:debug:main org.macports.load registered provides 'load', a pre-existing
procedure. Target override will not be provided
:debug:main org.macports.unload registered provides 'unload', a pre-
existing procedure. Target override will not be provided
:debug:main org.macports.distfiles registered provides 'distfiles', a pre-
existing procedure. Target override will not be provided
:debug:main adding the default universal variant
:debug:main Reading variant descriptions from
/opt/local/var/macports/sources/rsync.macports.org/release/ports/_resources/port1.0/variant_descriptions.conf
:debug:main Executing variant universal provides universal
:debug:main No need to upgrade! expat 2.0.1_0 >= expat 2.0.1_0
:debug:main Attempting ln -sf
/opt/local/var/macports/build/_opt_local_var_macports_sources_rsync.macports.org_release_ports_mail_libidn/work
/opt/local/var/macports/sources/rsync.macports.org/release/ports/mail/libidn/work
:debug:main Starting logging for libidn
:debug:destroot Starting logging for libidn
:debug:clean epoch: in tree: 1 installed: 1
:debug:clean openssl 0.9.8o_0 exists in the ports tree
:debug:clean openssl 0.9.8o_0 +universal is the latest installed
:debug:clean openssl 0.9.8o_0 +universal is active
:debug:clean Merging existing variants '+universal' into variants
:debug:clean new fully merged portvariants: universal +
:debug:clean Changing to port directory:
/opt/local/var/macports/sources/rsync.macports.org/release/ports/devel/openssl
:debug:clean OS darwin/10.3.0 (Mac OS X 10.6) arch i386
:debug:clean org.macports.load registered provides 'load', a pre-existing
procedure. Target override will not be provided
:debug:clean org.macports.unload registered provides 'unload', a pre-
existing procedure. Target override will not be provided
:debug:clean org.macports.distfiles registered provides 'distfiles', a
pre-existing procedure. Target override will not be provided
:debug:clean Using group file
/opt/local/var/macports/sources/rsync.macports.org/release/ports/_resources/port1.0/group/muniversal-1.0.tcl
:debug:clean Reading variant descriptions from
/opt/local/var/macports/sources/rsync.macports.org/release/ports/_resources/port1.0/variant_descriptions.conf
:debug:clean universal variant already exists, so not adding the default
one
:debug:clean Executing variant universal provides universal
:debug:clean No need to upgrade! openssl 0.9.8o_0 >= openssl 0.9.8o_0
:debug:clean epoch: in tree: 0 installed: 0
:debug:clean curl-ca-bundle 7.21.0_0 exists in the ports tree
:debug:clean curl-ca-bundle 7.20.0_0 is the latest installed
:debug:clean curl-ca-bundle 7.20.0_0 is active
:debug:clean Merging existing variants '' into variants
:debug:clean new fully merged portvariants:
:debug:clean Changing to port directory:
/opt/local/var/macports/sources/rsync.macports.org/release/ports/net/curl-
ca-bundle
:debug:clean OS darwin/10.3.0 (Mac OS X 10.6) arch i386
:debug:clean org.macports.load registered provides 'load', a pre-existing
procedure. Target override will not be provided
:debug:clean org.macports.unload registered provides 'unload', a pre-
existing procedure. Target override will not be provided
:debug:clean org.macports.distfiles registered provides 'distfiles', a
pre-existing procedure. Target override will not be provided
:debug:clean universal_variant is false, so not adding the default
universal variant
:debug:clean epoch: in tree: 0 installed: 0
:debug:clean perl5 5.8.9_0 exists in the ports tree
:debug:clean perl5 5.8.9_0 is the latest installed
:debug:clean perl5 5.8.9_0 is active
:debug:clean Merging existing variants '' into variants
:debug:clean new fully merged portvariants:
:debug:clean Changing to port directory:
/opt/local/var/macports/sources/rsync.macports.org/release/ports/lang/perl5
:debug:clean OS darwin/10.3.0 (Mac OS X 10.6) arch i386
:debug:clean org.macports.load registered provides 'load', a pre-existing
procedure. Target override will not be provided
:debug:clean org.macports.unload registered provides 'unload', a pre-
existing procedure. Target override will not be provided
:debug:clean org.macports.distfiles registered provides 'distfiles', a
pre-existing procedure. Target override will not be provided
:debug:clean universal_variant is false, so not adding the default
universal variant
:debug:clean No need to upgrade! perl5 5.8.9_0 >= perl5 5.8.9_0
:debug:clean epoch: in tree: 0 installed: 0
:debug:clean perl5.8 5.8.9_3 exists in the ports tree
:debug:clean perl5.8 5.8.9_3 is the latest installed
:debug:clean perl5.8 5.8.9_3 +universal is active
:debug:clean Merging existing variants '+universal' into variants
:debug:clean new fully merged portvariants: universal +
:debug:clean Changing to port directory:
/opt/local/var/macports/sources/rsync.macports.org/release/ports/lang/perl5.8
:debug:clean OS darwin/10.3.0 (Mac OS X 10.6) arch i386
:debug:clean org.macports.load registered provides 'load', a pre-existing
procedure. Target override will not be provided
:debug:clean org.macports.unload registered provides 'unload', a pre-
existing procedure. Target override will not be provided
:debug:clean org.macports.distfiles registered provides 'distfiles', a
pre-existing procedure. Target override will not be provided
:debug:clean adding the default universal variant
:debug:clean Reading variant descriptions from
/opt/local/var/macports/sources/rsync.macports.org/release/ports/_resources/port1.0/variant_descriptions.conf
:debug:clean Executing variant universal provides universal
:debug:clean No need to upgrade! perl5.8 5.8.9_3 >= perl5.8 5.8.9_3
:debug:clean Attempting ln -sf
/opt/local/var/macports/build/_opt_local_var_macports_sources_rsync.macports
.org_release_ports_net_curl-ca-bundle/work
/opt/local/var/macports/sources/rsync.macports.org/release/ports/net/curl-
ca-bundle/work
:debug:clean Starting logging for curl-ca-bundle
:debug:destroot Starting logging for curl-ca-bundle
:debug:clean Attempting ln -sf
/opt/local/var/macports/build/_opt_local_var_macports_sources_rsync.macports.org_release_ports_net_curl/work
/opt/local/var/macports/sources/rsync.macports.org/release/ports/net/curl/work
:debug:clean Starting logging for curl
:debug:destroot Starting logging for curl
:msg:clean ---> Computing dependencies for freepops:info:clean
.:debug:clean Searching for dependency: curl
:debug:clean Found Dependency: receipt exists for curl
:debug:clean Searching for dependency: expat
:debug:clean Found Dependency: receipt exists for expat
:debug:clean Searching for dependency: openssl
:debug:clean Found Dependency: receipt exists for openssl
:debug:clean Searching for dependency: zlib
:debug:clean Found Dependency: receipt exists for zlib
:msg:clean
:debug:main Executing org.macports.main (freepops)
:msg:main ---> Fetching freepops
:debug:fetch fetch phase started at Sun Jun 27 18:57:59 EDT 2010
:debug:fetch Executing org.macports.fetch (freepops)
:info:fetch ---> freepops-0.0.18.tar.gz doesn't seem to exist in
/opt/local/var/macports/distfiles/freepops
:debug:fetch Pinging downloads.sourceforge.net...
:debug:fetch Pinging easynews.dl.sourceforge.net...
:debug:fetch Pinging internap.dl.sourceforge.net...
:debug:fetch Pinging superb-east.dl.sourceforge.net...
:debug:fetch Pinging superb-west.dl.sourceforge.net...
:debug:fetch Pinging voxel.dl.sourceforge.net...
:debug:fetch Pinging ufpr.dl.sourceforge.net...
:debug:fetch Pinging dfn.dl.sourceforge.net...
:debug:fetch Pinging garr.dl.sourceforge.net...
:debug:fetch Pinging heanet.dl.sourceforge.net...
:debug:fetch Pinging kent.dl.sourceforge.net...
:debug:fetch Pinging mesh.dl.sourceforge.net...
:debug:fetch Pinging surfnet.dl.sourceforge.net...
:debug:fetch Pinging switch.dl.sourceforge.net...
:debug:fetch Pinging nchc.dl.sourceforge.net...
:debug:fetch Pinging internode.dl.sourceforge.net...
:debug:fetch Pinging transact.dl.sourceforge.net...
:debug:fetch Pinging optusnet.dl.sourceforge.net...
:debug:fetch Pinging distfiles.macports.org...
:debug:fetch Pinging aarnet.au.distfiles.macports.org...
:debug:fetch Pinging lil.fr.distfiles.macports.org...
:debug:fetch downloads.sourceforge.net ping time is 42.391
:debug:fetch easynews.dl.sourceforge.net ping time is 69.857
:debug:fetch internap.dl.sourceforge.net ping time is 19.449
:debug:fetch superb-east.dl.sourceforge.net ping time is 38.711
:debug:fetch superb-west.dl.sourceforge.net ping time is 38.320
:debug:fetch voxel.dl.sourceforge.net ping time is 12.395
:debug:fetch ufpr.dl.sourceforge.net ping time is 229.811
:debug:fetch dfn.dl.sourceforge.net ping time is 119.428
:debug:fetch garr.dl.sourceforge.net ping time is 112.029
:debug:fetch heanet.dl.sourceforge.net ping time is 95.222
:debug:fetch kent.dl.sourceforge.net ping time is 87.909
:debug:fetch mesh.dl.sourceforge.net ping time is 107.219
:debug:fetch surfnet.dl.sourceforge.net ping time is 101.373
:debug:fetch switch.dl.sourceforge.net ping time is 102.386
:debug:fetch nchc.dl.sourceforge.net ping time is 233.199
:debug:fetch internode.dl.sourceforge.net ping time is 272.795
:debug:fetch transact.dl.sourceforge.net ping time is 252.159
:debug:fetch optusnet.dl.sourceforge.net ping time is 259.161
:debug:fetch distfiles.macports.org ping time is 89.286
:debug:fetch aarnet.au.distfiles.macports.org ping time is 275.503
:debug:fetch lil.fr.distfiles.macports.org ping time is 91.615
:msg:fetch ---> Attempting to fetch freepops-0.0.18.tar.gz from
http://voxel.dl.sourceforge.net/freepops
:msg:fetch ---> Verifying checksum(s) for freepops
:debug:checksum checksum phase started at Sun Jun 27 18:58:04 EDT 2010
:debug:checksum Executing org.macports.checksum (freepops)
:info:checksum ---> Checksumming freepops-0.0.18.tar.gz
:debug:checksum Correct (md5) checksum for freepops-0.0.18.tar.gz
:msg:checksum ---> Extracting freepops
:debug:extract extract phase started at Sun Jun 27 18:58:04 EDT 2010
:debug:extract Executing org.macports.extract (freepops)
:info:extract ---> Extracting freepops-0.0.18.tar.gz
:debug:extract setting option extract.args to
/opt/local/var/macports/distfiles/freepops/freepops-0.0.18.tar.gz
:debug:extract Environment: CPATH='/opt/local/include'
CC_PRINT_OPTIONS_FILE='/opt/local/var/macports/build/_opt_local_var_macports_sources_rsync.macports.org_release_ports_mail_freepops/work/.CC_PRINT_OPTIONS'
LIBRARY_PATH='/opt/local/lib' CC_PRINT_OPTIONS='YES'
MACOSX_DEPLOYMENT_TARGET='10.6'
:debug:extract Assembled command: 'cd
"/opt/local/var/macports/build/_opt_local_var_macports_sources_rsync.macports.org_release_ports_mail_freepops/work"
&& /usr/bin/gzip -dc
/opt/local/var/macports/distfiles/freepops/freepops-0.0.18.tar.gz |
/usr/bin/gnutar --no-same-owner -xf -'
:debug:patch patch phase started at Sun Jun 27 18:58:05 EDT 2010
:debug:patch Executing org.macports.patch (freepops)
:msg:patch ---> Applying patches to freepops
:info:patch ---> Applying
/opt/local/var/macports/sources/rsync.macports.org/release/ports/mail/freepops/files
/patch-darwin
:debug:patch Environment: CPATH='/opt/local/include'
CC_PRINT_OPTIONS_FILE='/opt/local/var/macports/build/_opt_local_var_macports_sources_rsync.macports.org_release_ports_mail_freepops/work/.CC_PRINT_OPTIONS'
LIBRARY_PATH='/opt/local/lib' CC_PRINT_OPTIONS='YES'
MACOSX_DEPLOYMENT_TARGET='10.6'
:debug:patch Assembled command: 'cd
"/opt/local/var/macports/build/_opt_local_var_macports_sources_rsync.macports.org_release_ports_mail_freepops/work/freepops-0.0.18"
&& /usr/bin/patch -p0'
:info:patch patching file ./Makefile
:info:patch patching file ./configure.sh
:info:patch patching file ./doc/freepopsd.1
:info:patch patching file ./modules/src/luafull/Makefile
:info:patch patching file ./src/Makefile
:info:patch patching file ./src/freepops.h
:info:patch patching file ./src/lua/freepops.lua
:msg:patch ---> Configuring freepops
:debug:patch Using compiler 'Mac OS X gcc 4.2'
:debug:configure configure phase started at Sun Jun 27 18:58:05 EDT 2010
:debug:configure Executing proc-pre-org.macports.configure-configure-0
:debug:configure Executing org.macports.configure (freepops)
:debug:configure Environment: CPATH='/opt/local/include' CFLAGS='-O2 -arch
x86_64' CPPFLAGS='-I/opt/local/include' CXXFLAGS='-O2 -arch x86_64'
LIBRARY_PATH='/opt/local/lib' MACOSX_DEPLOYMENT_TARGET='10.6'
CXX='/usr/bin/g++-4.2'
CC_PRINT_OPTIONS_FILE='/opt/local/var/macports/build/_opt_local_var_macports_sources_rsync.macports.org_release_ports_mail_freepops/work/.CC_PRINT_OPTIONS'
F90FLAGS='-O2 -m64' LDFLAGS='-L/opt/local/lib -arch x86_64'
OBJC='/usr/bin/gcc-4.2' FCFLAGS='-O2 -m64' INSTALL='/usr/bin/install -c'
OBJCFLAGS='-O2 -arch x86_64' FFLAGS='-O2 -m64' CC_PRINT_OPTIONS='YES'
CC='/usr/bin/gcc-4.2'
:debug:configure Assembled command: 'cd
"/opt/local/var/macports/build/_opt_local_var_macports_sources_rsync.macports.org_release_ports_mail_freepops/work/freepops-0.0.18"
&& ./configure.sh osx'
:msg:configure ---> Building freepops
:debug:build build phase started at Sun Jun 27 18:58:05 EDT 2010
:debug:build Executing org.macports.build (freepops)
:debug:build Environment: CPATH='/opt/local/include'
CC_PRINT_OPTIONS_FILE='/opt/local/var/macports/build/_opt_local_var_macports_sources_rsync.macports.org_release_ports_mail_freepops/work/.CC_PRINT_OPTIONS'
LIBRARY_PATH='/opt/local/lib' CC_PRINT_OPTIONS='YES'
MACOSX_DEPLOYMENT_TARGET='10.6'
:debug:build Assembled command: 'cd
"/opt/local/var/macports/build/_opt_local_var_macports_sources_rsync.macports.org_release_ports_mail_freepops/work/freepops-0.0.18"
&& /usr/bin/make -j2 all WHERE=/opt/local/'
:info:build building freepopsd
:info:build building dep for luabox.c
:info:build building getopt
:info:build luabox.c:19:18: error: luay.h: No such file or directory
:info:build luabox.c:23:28: error: pop3server_lua.h: No such file or
directory
:info:build luabox.c:24:21: error: log_lua.h: No such file or directory
:info:build luabox.c:25:22: error: mlex_lua.h: No such file or directory
:info:build luabox.c:26:28: error: stringhack_lua.h: No such file or
directory
:info:build luabox.c:27:25: error: session_lua.h: No such file or
directory
:info:build luabox.c:28:22: error: curl_lua.h: No such file or directory
:info:build luabox.c:29:25: error: getdate_lua.h: No such file or
directory
:info:build luabox.c:30:23: error: psock_lua.h: No such file or directory
:info:build luabox.c:31:24: error: base64_lua.h: No such file or directory
:info:build luabox.c:32:28: error: regularexp_lua.h: No such file or
directory
:info:build luabox.c:33:20: error: lxplib.h: No such file or directory
:info:build luabox.c:34:24: error: crypto_lua.h: No such file or directory
:info:build luabox.c:36:17: error: log.h: No such file or directory
:info:build building dep for freepops.c
:info:build freepops.c:45:22: error: getopt1.h: No such file or directory
:info:build freepops.c:54:23: error: popserver.h: No such file or
directory
:info:build In file included from freepops.c:55:
:info:build engine.h:21:22: error: popstate.h: No such file or directory
:info:build freepops.c:56:24: error: altsocklib.h: No such file or
directory
:info:build freepops.c:57:24: error: regularexp.h: No such file or
directory
:info:build freepops.c:60:18: error: luay.h: No such file or directory
:info:build freepops.c:63:17: error: log.h: No such file or directory
:info:build freepops.c:66:17: error: pid.h: No such file or directory
:info:build building dep for engine.c
:info:build building dep for getopt1.c
:info:build building dep for getopt.c
:info:build engine.c:24:23: error: popserver.h: No such file or directory
:info:build engine.c:25:22: error: popstate.h: No such file or directory
:info:build engine.c:30:18: error: luay.h: No such file or directory
:info:build engine.c:36:17: error: log.h: No such file or directory
:info:build make[1]: *** No rule to make target `.engine.d', needed by
`all'. Stop.
:info:build make: *** [src] Error 2
:info:build make: *** Waiting for unfinished jobs....
:info:build -n compiling getopt.c ->
:info:build -n compiling getopt1.c ->
:info:build getopt1.o
:info:build getopt.o
:info:build -n linking
:info:build libgetopt.a
:info:build building lua
:info:build building core library... lapi.c:310: error: expected
declaration specifiers or '...' before '(' token
:info:build lapi.c:310: error: expected declaration specifiers or '...'
before '(' token
:info:build lapi.c:310: error: conflicting types for 'lua_tolstring'
:info:build /opt/local/include/lua.h:149: error: previous declaration of
'lua_tolstring' was here
:info:build lapi.c: In function 'lua_tolstring':
:info:build lapi.c:311: error: 'idx' undeclared (first use in this
function)
:info:build lapi.c:311: error: (Each undeclared identifier is reported
only once
:info:build lapi.c:311: error: for each function it appears in.)
:info:build lapi.c: At top level:
:info:build lapi.c:327: error: expected declaration specifiers or '...'
before '(' token
:info:build lapi.c:327: error: conflicting types for 'lua_objlen'
:info:build /opt/local/include/lua.h:150: error: previous declaration of
'lua_objlen' was here
:info:build lapi.c: In function 'lua_objlen':
:info:build lapi.c:328: error: 'idx' undeclared (first use in this
function)
:info:build lapi.c: At top level:
:info:build lapi.c:514: error: expected declaration specifiers or '...'
before numeric constant
:info:build lapi.c:514: error: expected declaration specifiers or '...'
before numeric constant
:info:build lapi.c:514: error: conflicting types for 'lua_createtable'
:info:build /opt/local/include/lua.h:181: error: previous declaration of
'lua_createtable' was here
:info:build lapi.c:774: error: expected declaration specifiers or '...'
before numeric constant
:info:build lapi.c:774: error: expected declaration specifiers or '...'
before numeric constant
:info:build lapi.c:774: error: conflicting types for 'lua_gc'
:info:build /opt/local/include/lua.h:230: error: previous declaration of
'lua_gc' was here
:info:build lstate.c:181:34: error: macro "lua_open" passed 1 arguments,
but takes just 0
:info:build lstate.c:181: error: expected '=', ',', ';', 'asm' or
'__attribute__' before '{' token
:info:build ltable.c: In function 'luaH_mainposition':
:info:build ltable.c:108: warning: cast from pointer to integer of
different size
:info:build ltable.c:110: warning: cast from pointer to integer of
different size
:info:build ranlib: file: ../lib/liblua.a(ltests.o) has no symbols
:info:build ranlib: file: ../lib/liblua.a(ltests.o) has no symbols
:info:build done.
:info:build building standard library... lauxlib.c:126: error: expected
declaration specifiers or '...' before '(' token
:info:build lauxlib.c:126: error: expected declaration specifiers or '...'
before '(' token
:info:build lauxlib.c:126: error: conflicting types for 'lua_getfield'
:info:build /opt/local/include/lua.h:178: error: previous declaration of
'lua_getfield' was here
:info:build lauxlib.c: In function 'lua_getfield':
:info:build lauxlib.c:127: error: 'tname' undeclared (first use in this
function)
:info:build lauxlib.c:127: error: (Each undeclared identifier is reported
only once
:info:build lauxlib.c:127: error: for each function it appears in.)
:info:build lauxlib.c: At top level:
:info:build lauxlib.c:282: error: expected identifier or '(' before 'void'
:info:build lauxlib.c:282: error: expected ')' before numeric constant
:info:build lauxlib.c:301: error: expected identifier or '(' before 'int'
:info:build lauxlib.c:301: error: expected ')' before 'lua_objlen'
:info:build lauxlib.c: In function 'callalert':
:info:build lauxlib.c:555: error: too many arguments to function
'lua_getfield'
:info:build lbaselib.c: In function 'luaB_gcinfo':
:info:build lbaselib.c:191: warning: implicit declaration of function
'lua_getgcthreshold'
:info:build lbaselib.c: In function 'luaB_collectgarbage':
:info:build lbaselib.c:197: warning: implicit declaration of function
'lua_setgcthreshold'
:info:build lbaselib.c: In function 'pushcomposename':
:info:build lbaselib.c:443: warning: passing argument 2 of 'strchr' makes
integer from pointer without a cast
:info:build ldblib.c: In function 'debug':
:info:build ldblib.c:218: warning: implicit declaration of function
'lua_dostring'
:info:build liolib.c: In function 'f_seek':
:info:build liolib.c:573: warning: implicit declaration of function
'luaL_findstring'
:info:build done.
:info:build building lua... lua.c:77: error: 'luaopen_loadlib' undeclared
here (not in a function)
:info:build lua.c:259:36: error: macro "lua_readline" requires 3
arguments, but only 2 given
:info:build lua.c: In function 'load_string':
:info:build lua.c:259: error: 'lua_readline' undeclared (first use in this
function)
:info:build lua.c:259: error: (Each undeclared identifier is reported only
once
:info:build lua.c:259: error: for each function it appears in.)
:info:build lua.c:268:38: error: macro "lua_readline" requires 3
arguments, but only 2 given
:info:build make[3]: *** [bin/lua] Error 1
:info:build make[2]: *** [lua-5.0.2] Error 2
:info:build shell command " cd
"/opt/local/var/macports/build/_opt_local_var_macports_sources_rsync.macports.org_release_ports_mail_freepops/work/freepops-0.0.18"
&& /usr/bin/make -j2 all WHERE=/opt/local/ " returned error 2
:error:build Target org.macports.build returned: shell command failed
:debug:build Backtrace: shell command failed
while executing
"command_exec build"
(procedure "portbuild::build_main" line 8)
invoked from within
"$procedure $targetname"
:info:build Warning: the following items did not execute (for freepops):
org.macports.activate org.macports.build org.macports.destroot
org.macports.install
:notice:build Log for freepops is at:
/opt/local/var/macports/logs/_opt_local_var_macports_sources_rsync.macports.org_release_ports_mail_freepops/main.log
}}}
--
Ticket URL: <http://trac.macports.org/ticket/25448>
MacPorts <http://www.macports.org/>
Ports system for Mac OS
More information about the macports-tickets
mailing list