[MacPorts] #27004: ncursesw @5.7_0 build failure
MacPorts
noreply at macports.org
Mon Oct 25 16:15:41 PDT 2010
#27004: ncursesw @5.7_0 build failure
------------------------------------+---------------------------------------
Reporter: ossumguywill@… | Owner: macports-tickets@…
Type: defect | Status: new
Priority: Normal | Milestone:
Component: ports | Version: 1.9.1
Keywords: ncurses ncursesw | Port: ncursesw
------------------------------------+---------------------------------------
ncursesw has been giving me a LOT of grief... I'm in over my head here.
Starting with:
{{{
---> Computing dependencies for ncursesw
---> Building ncursesw
Error: Target org.macports.build returned: shell command failed
Log for ncursesw is at:
/opt/local/var/macports/logs/_opt_local_var_macports_sources_rsync.macports.org_release_ports_devel_ncursesw/main.log
Error: Unable to upgrade port: 1
}}}
opt/local/var/macports/logs/_opt_local_var_macports_sources_rsync.macports.org_release_ports_devel_ncursesw/main.log
reads
{{{
version:1
:msg:main ---> Computing dependencies for ncursesw:info:main .:msg:main
:debug:main Executing org.macports.main (ncursesw)
:debug:main Skipping completed org.macports.fetch (ncursesw)
:debug:main Skipping completed org.macports.checksum (ncursesw)
:debug:main Skipping completed org.macports.extract (ncursesw)
:debug:main Skipping completed org.macports.patch (ncursesw)
:debug:main Skipping completed org.macports.configure (ncursesw)
:msg:main ---> Building ncursesw
:debug:build build phase started at Mon Oct 25 18:02:34 CDT 2010
:debug:build Executing org.macports.build (ncursesw)
:debug:build Environment: CPATH='/opt/local/include'
CC_PRINT_OPTIONS_FILE='/opt/local/var/macports/build/_opt_local_var_macports_sources_rsync.macports.org_release_ports_devel_ncursesw/work/.CC_PRINT_OPTIONS'
LIBRARY_PATH='/opt/local/lib' CC_PRINT_OPTIONS='YES'
MACOSX_DEPLOYMENT_TARGET='10.6'
:debug:build Assembled command: 'cd
"/opt/local/var/macports/build/_opt_local_var_macports_sources_rsync.macports.org_release_ports_devel_ncursesw/work/ncurses-5.7"
&& /usr/bin/make -j2 all'
:info:build cd man && /usr/bin/make DESTDIR="" all
:info:build make[1]: Nothing to be done for `all'.
:info:build cd include && /usr/bin/make DESTDIR="" all
:info:build make[1]: Nothing to be done for `all'.
:info:build cd ncurses && /usr/bin/make DESTDIR="" all
:info:build /usr/bin/gcc-4.2 -o make_hash -DHAVE_CONFIG_H -I../ncurses -I.
-I./../include -I../include -DHAVE_CONFIG_H -I../ncurses -I. -I.
-I../include -U_XOPEN_SOURCE -D_XOPEN_SOURCE=500 -DSIGWINCH=28
-D_XOPEN_SOURCE_EXTENDED -DNDEBUG -I/opt/local/include/ncursesw -pipe -O2
-arch x86_64 --param max-inline-insns-single=1200 -no-cpp-precomp
-DMAIN_PROGRAM ./tinfo/comp_hash.c -arch x86_64 -Wl,-search_paths_first
:info:build sh -e ./tty/MKexpanded.sh "/usr/bin/gcc-4.2 -E"
-DHAVE_CONFIG_H -I../ncurses -I. -I. -I../include -U_XOPEN_SOURCE
-D_XOPEN_SOURCE=500 -DSIGWINCH=28 -D_XOPEN_SOURCE_EXTENDED -DNDEBUG
-I/opt/local/include/ncursesw > expanded.c
:info:build In file included from ./../include/ncurses_cfg.h:178,
:info:build from ../ncurses/curses.priv.h:55,
:info:build from ./tinfo/comp_hash.c:42:
:info:build ./../include/ncurses_def.h:5:1: error: unterminated #ifndef
:info:build In file included from ../ncurses/curses.priv.h:261,
:info:build from ./tinfo/comp_hash.c:42:
:info:build ./../include/term_entry.h:54: error: expected specifier-
qualifier-list before 'TERMTYPE'
:info:build ./../include/term_entry.h:123: error: expected ')' before '*'
token
:info:build ./../include/term_entry.h:124: error: expected ')' before '*'
token
:info:build ./../include/term_entry.h:128: error: expected ')' before '*'
token
:info:build ./../include/term_entry.h:129: error: expected ')' before '*'
token
:info:build ./../include/term_entry.h:132: error: expected ')' before '*'
token
:info:build ./../include/term_entry.h:138: error: expected ')' before '*'
token
:info:build ./../include/term_entry.h:150: error: expected ')' before '*'
token
:info:build ./../include/term_entry.h:158: error: expected ')' before '*'
token
:info:build ./../include/term_entry.h:159: error: expected ')' before '*'
token
:info:build ./../include/term_entry.h:162: error: expected ')' before '*'
token
:info:build In file included from ./tinfo/comp_hash.c:42:
:info:build ../ncurses/curses.priv.h:514: error: expected specifier-
qualifier-list before 'TERMINAL'
:info:build ../ncurses/curses.priv.h:675: error: expected specifier-
qualifier-list before 'TTY'
:info:build ../ncurses/curses.priv.h:707: error: expected specifier-
qualifier-list before 'TERMINAL'
:info:build In file included from ./tinfo/comp_hash.c:42:
:info:build ../ncurses/curses.priv.h:1531: error: expected ')' before '*'
token
:info:build ../ncurses/curses.priv.h:1579: error: expected declaration
specifiers or '...' before 'TERMTYPE'
:info:build ../ncurses/curses.priv.h:1595: error: expected declaration
specifiers or '...' before 'TERMTYPE'
:info:build ../ncurses/curses.priv.h:1601: error: expected declaration
specifiers or '...' before 'TERMTYPE'
:info:build make[1]: *** [make_hash] Error 1
:info:build make[1]: *** Waiting for unfinished jobs....
:info:build make: *** [all] Error 2
:info:build shell command " cd
"/opt/local/var/macports/build/_opt_local_var_macports_sources_rsync.macports.org_release_ports_devel_ncursesw/work/ncurses-5.7"
&& /usr/bin/make -j2 all " returned error 2
:error:build Target org.macports.build returned: shell command failed
:debug:build Backtrace: shell command failed
while executing
"command_exec build"
(procedure "portbuild::build_main" line 8)
invoked from within
"$procedure $targetname"
:info:build Warning: the following items did not execute (for ncursesw):
org.macports.destroot org.macports.build
:notice:build Log for ncursesw is at:
/opt/local/var/macports/logs/_opt_local_var_macports_sources_rsync.macports.org_release_ports_devel_ncursesw/main.log
}}}
Any ideas? I'm stuck here. Running 10.6.4, xcode 3.2.3.
Thanks!
--
Ticket URL: <https://trac.macports.org/ticket/27004>
MacPorts <http://www.macports.org/>
Ports system for Mac OS
More information about the macports-tickets
mailing list