[MacPorts] #46677: gcc48 @4.8.4 does not build on PPC Leopard, Mac OS X 10.5.8, in libiberty due to architecture issue
MacPorts
noreply at macports.org
Sun Jan 25 14:13:09 PST 2015
#46677: gcc48 @4.8.4 does not build on PPC Leopard, Mac OS X 10.5.8, in libiberty
due to architecture issue
-----------------------------+--------------------------------
Reporter: Peter_Dyballa@… | Owner: macports-tickets@…
Type: defect | Status: new
Priority: Normal | Milestone:
Component: ports | Version: 2.3.3
Keywords: | Port: gcc48
-----------------------------+--------------------------------
{{{
/opt/local/var/macports/build/_opt_local_var_macports_sources_nue.de.rsync.macports.org_macports_release_tarballs_ports_lang_gcc48/gcc48/work/build
/./prev-gcc/xg++
-B/opt/local/var/macports/build/_opt_local_var_macports_sources_nue.de.rsync.macports.org_macports_release_tarballs_ports_lang_gcc48/gcc48/work/build
/./prev-gcc/ -B/opt/local/ppc-apple-darwin9/bin/ -nostdinc++
-B/opt/local/var/macports/build/_opt_local_var_macports_sources_nue.de.rsync.macports.org_macports_release_tarballs_ports_lang_gcc48/gcc48/work/build
/prev-ppc-apple-darwin9/libstdc++-v3/src/.libs
-B/opt/local/var/macports/build/_opt_local_var_macports_sources_nue.de.rsync.macports.org_macports_release_tarballs_ports_lang_gcc48/gcc48/work/build
/prev-ppc-apple-darwin9/libstdc++-v3/libsupc++/.libs
-I/opt/local/var/macports/build/_opt_local_var_macports_sources_nue.de.rsync.macports.org_macports_release_tarballs_ports_lang_gcc48/gcc48/work/build
/prev-ppc-apple-darwin9/libstdc++-v3/include/ppc-apple-darwin9
-I/opt/local/var/macports/build/_opt_local_var_macports_sources_nue.de.rsync.macports.org_macports_release_tarballs_ports_lang_gcc48/gcc48/work/build
/prev-ppc-apple-darwin9/libstdc++-v3/include
-I/opt/local/var/macports/build/_opt_local_var_macports_sources_nue.de.rsync.macports.org_macports_release_tarballs_ports_lang_gcc48/gcc48/work/gcc-4.8.4/libstdc++-v3/libsupc++
-L/opt/local/var/macports/build/_opt_local_var_macports_sources_nue.de.rsync.macports.org_macports_release_tarballs_ports_lang_gcc48/gcc48/work/build
/prev-ppc-apple-darwin9/libstdc++-v3/src/.libs
-L/opt/local/var/macports/build/_opt_local_var_macports_sources_nue.de.rsync.macports.org_macports_release_tarballs_ports_lang_gcc48/gcc48/work/build
/prev-ppc-apple-darwin9/libstdc++-v3/libsupc++/.libs -g -O2 -mdynamic-
no-pic -gtoggle -DIN_GCC -fno-exceptions -fno-rtti -fasynchronous-
unwind-tables -W -Wall -Wno-narrowing -Wwrite-strings -Wcast-qual
-Wmissing-format-attribute -pedantic -Wno-long-long -Wno-variadic-macros
-Wno-overlength-strings -DHAVE_CONFIG_H -DGENERATOR_FILE -static-
libstdc++ -static-libgcc -o build/gengtype \
build/gengtype.o build/errors.o build/gengtype-lex.o build
/gengtype-parse.o build/gengtype-state.o build/version.o
.././libiberty/libiberty.a
final section layout:
__TEXT/__text addr=0x00001790, size=0x00019340, fileOffset=0x00000790,
type=1
__TEXT/__text_cold addr=0x0001AAD0, size=0x000005C4,
fileOffset=0x00019AD0, type=1
__TEXT/__text_startup addr=0x0001B094, size=0x00002484,
fileOffset=0x0001A094, type=1
__TEXT/__symbol_stub1 addr=0x0001D518, size=0x00000320,
fileOffset=0x0001C518, type=27
__TEXT/__cstring addr=0x0001D838, size=0x000057B6,
fileOffset=0x0001C838, type=12
__TEXT/__const addr=0x00022FF0, size=0x00004324,
fileOffset=0x00021FF0, type=0
__TEXT/__eh_frame addr=0x00027318, size=0x00002CE4,
fileOffset=0x00026318, type=18
__DATA/__dyld addr=0x0002A000, size=0x0000001C, fileOffset=0x00029000,
type=29
__DATA/__nl_symbol_ptr addr=0x0002A01C, size=0x000000A4,
fileOffset=0x0002901C, type=28
__DATA/__la_symbol_ptr addr=0x0002A0C0, size=0x000000C8,
fileOffset=0x000290C0, type=26
__DATA/__data addr=0x0002A188, size=0x00000268, fileOffset=0x00029188,
type=0
__DATA/__const addr=0x0002A3F0, size=0x000007EC,
fileOffset=0x000293F0, type=0
__DATA/__static_data addr=0x0002ABDC, size=0x00000002,
fileOffset=0x00029BDC, type=0
__DATA/__bss2 addr=0x0002ABE0, size=0x0000042B, fileOffset=0x00000000,
type=24
__DATA/__pu_bss2 addr=0x0002B00C, size=0x00000084,
fileOffset=0x00000000, type=24
__DATA/__common addr=0x0002B090, size=0x00000010,
fileOffset=0x00000000, type=24
ld: 32-bit absolute address out of range (0x10002ABEC max is 4GB): from
rtx_name + 0x000002AC (0x0002A854) to 0x10002ABEC in rtx_name
from build/gengtype.o for architecture ppc
collect2: error: ld returned 1 exit status
make[3]: *** [build/gengtype] Error 1
make[3]: Leaving directory
`/opt/local/var/macports/build/_opt_local_var_macports_sources_nue.de.rsync.macports.org_macports_release_tarballs_ports_lang_gcc48/gcc48/work/build/gcc'
make[2]: *** [all-stage2-gcc] Error 2
make[2]: Leaving directory
`/opt/local/var/macports/build/_opt_local_var_macports_sources_nue.de.rsync.macports.org_macports_release_tarballs_ports_lang_gcc48/gcc48/work/build'
make[1]: *** [stage2-bubble] Error 2
make[1]: Leaving directory
`/opt/local/var/macports/build/_opt_local_var_macports_sources_nue.de.rsync.macports.org_macports_release_tarballs_ports_lang_gcc48/gcc48/work/build'
make: *** [bootstrap] Error 2
make: Leaving directory
`/opt/local/var/macports/build/_opt_local_var_macports_sources_nue.de.rsync.macports.org_macports_release_tarballs_ports_lang_gcc48/gcc48/work/build'
Command failed: cd
"/opt/local/var/macports/build/_opt_local_var_macports_sources_nue.de.rsync.macports.org_macports_release_tarballs_ports_lang_gcc48/gcc48/work/build"
&& /usr/bin/make -w bootstrap
Exit code: 2
Error: org.macports.build for port gcc48 returned: command execution
failed
}}}
--
Ticket URL: <https://trac.macports.org/ticket/46677>
MacPorts <https://www.macports.org/>
Ports system for OS X
More information about the macports-tickets
mailing list