[MacPorts] #49057: libtorrent-rasterbar 1.0.6_0 build failed on MacOS 10.7 (Lion)

MacPorts noreply at macports.org
Fri Oct 2 07:56:31 PDT 2015


#49057: libtorrent-rasterbar 1.0.6_0 build failed on MacOS 10.7 (Lion)
------------------------+----------------------------------
 Reporter:  beremour@…  |      Owner:  macports-tickets@…
     Type:  defect      |     Status:  new
 Priority:  Normal      |  Milestone:
Component:  ports       |    Version:  2.3.4
 Keywords:              |       Port:  libtorrent-rasterbar
------------------------+----------------------------------
 Please help to build Libtorrent-rasterbar 1.0.6 on Lion

 log file:

 version:1
 :msg:main --->  Computing dependencies for libtorrent-rasterbar:info:main
 .:debug:main libtorrent-rasterbar has no conflicts
 :debug:main Searching for dependency: pkgconfig
 :debug:main Found Dependency: receipt exists for pkgconfig
 :debug:main Searching for dependency: autoconf
 :debug:main Found Dependency: receipt exists for autoconf
 :debug:main Searching for dependency: automake
 :debug:main Found Dependency: receipt exists for automake
 :debug:main Searching for dependency: libtool
 :debug:main Found Dependency: receipt exists for libtool
 :debug:main Searching for dependency: boost
 :debug:main Found Dependency: receipt exists for boost
 :debug:main Searching for dependency: libgeoip
 :debug:main Found Dependency: receipt exists for libgeoip
 :debug:main Searching for dependency: openssl
 :debug:main Found Dependency: receipt exists for openssl
 :debug:main Searching for dependency: python27
 :debug:main Found Dependency: receipt exists for python27
 :msg:main
 :debug:main Executing org.macports.main (libtorrent-rasterbar)
 :debug:main changing euid/egid - current euid: 0 - current egid: 0
 :debug:main egid changed to: 501
 :debug:main euid changed to: 502
 :debug:main Skipping completed org.macports.archivefetch (libtorrent-
 rasterbar)
 :debug:main Privilege de-escalation not attempted as not running as root.
 :debug:main Skipping completed org.macports.fetch (libtorrent-rasterbar)
 :debug:main Privilege de-escalation not attempted as not running as root.
 :debug:main Skipping completed org.macports.checksum (libtorrent-
 rasterbar)
 :debug:main Privilege de-escalation not attempted as not running as root.
 :debug:main Skipping completed org.macports.extract (libtorrent-rasterbar)
 :debug:main Privilege de-escalation not attempted as not running as root.
 :debug:main Skipping completed org.macports.patch (libtorrent-rasterbar)
 :debug:main Privilege de-escalation not attempted as not running as root.
 :debug:main Skipping completed org.macports.configure (libtorrent-
 rasterbar)
 :debug:main Privilege de-escalation not attempted as not running as root.
 :debug:build build phase started at Fri Oct  2 19:30:22 AQTT 2015
 :notice:build --->  Building libtorrent-rasterbar
 :debug:build Executing org.macports.build (libtorrent-rasterbar)
 :debug:build Environment:
 CC_PRINT_OPTIONS='YES'
 CC_PRINT_OPTIONS_FILE='/opt/local/var/macports/build/_opt_local_var_macports_sources_rsync.macports
 .org_release_tarballs_ports_net_libtorrent-rasterbar/libtorrent-
 rasterbar/work/.CC_PRINT_OPTIONS'
 CPATH='/opt/local/include'
 LIBRARY_PATH='/opt/local/lib'
 MACOSX_DEPLOYMENT_TARGET='10.7'
 :debug:build Assembled command: 'cd
 "/opt/local/var/macports/build/_opt_local_var_macports_sources_rsync.macports
 .org_release_tarballs_ports_net_libtorrent-rasterbar/libtorrent-
 rasterbar/work/libtorrent-1_0_6" && /usr/bin/make -j4 -w all'
 :debug:build Executing command line:  cd
 "/opt/local/var/macports/build/_opt_local_var_macports_sources_rsync.macports
 .org_release_tarballs_ports_net_libtorrent-rasterbar/libtorrent-
 rasterbar/work/libtorrent-1_0_6" && /usr/bin/make -j4 -w all
 :info:build make: Entering directory
 `/opt/local/var/macports/build/_opt_local_var_macports_sources_rsync.macports
 .org_release_tarballs_ports_net_libtorrent-rasterbar/libtorrent-
 rasterbar/work/libtorrent-1_0_6'
 :info:build Making all in include/libtorrent
 :info:build make[1]: Entering directory
 `/opt/local/var/macports/build/_opt_local_var_macports_sources_rsync.macports
 .org_release_tarballs_ports_net_libtorrent-rasterbar/libtorrent-
 rasterbar/work/libtorrent-1_0_6/include/libtorrent'
 :info:build make[1]: Nothing to be done for `all'.
 :info:build make[1]: Leaving directory
 `/opt/local/var/macports/build/_opt_local_var_macports_sources_rsync.macports
 .org_release_tarballs_ports_net_libtorrent-rasterbar/libtorrent-
 rasterbar/work/libtorrent-1_0_6/include/libtorrent'
 :info:build Making all in src
 :info:build make[1]: Entering directory
 `/opt/local/var/macports/build/_opt_local_var_macports_sources_rsync.macports
 .org_release_tarballs_ports_net_libtorrent-rasterbar/libtorrent-
 rasterbar/work/libtorrent-1_0_6/src'
 :info:build make[1]: Nothing to be done for `all'.
 :info:build make[1]: Leaving directory
 `/opt/local/var/macports/build/_opt_local_var_macports_sources_rsync.macports
 .org_release_tarballs_ports_net_libtorrent-rasterbar/libtorrent-
 rasterbar/work/libtorrent-1_0_6/src'
 :info:build Making all in examples
 :info:build make[1]: Entering directory
 `/opt/local/var/macports/build/_opt_local_var_macports_sources_rsync.macports
 .org_release_tarballs_ports_net_libtorrent-rasterbar/libtorrent-
 rasterbar/work/libtorrent-1_0_6/examples'
 :info:build make[1]: Nothing to be done for `all'.
 :info:build make[1]: Leaving directory
 `/opt/local/var/macports/build/_opt_local_var_macports_sources_rsync.macports
 .org_release_tarballs_ports_net_libtorrent-rasterbar/libtorrent-
 rasterbar/work/libtorrent-1_0_6/examples'
 :info:build Making all in test
 :info:build make[1]: Entering directory
 `/opt/local/var/macports/build/_opt_local_var_macports_sources_rsync.macports
 .org_release_tarballs_ports_net_libtorrent-rasterbar/libtorrent-
 rasterbar/work/libtorrent-1_0_6/test'
 :info:build make[1]: Nothing to be done for `all'.
 :info:build make[1]: Leaving directory
 `/opt/local/var/macports/build/_opt_local_var_macports_sources_rsync.macports
 .org_release_tarballs_ports_net_libtorrent-rasterbar/libtorrent-
 rasterbar/work/libtorrent-1_0_6/test'
 :info:build Making all in bindings
 :info:build make[1]: Entering directory
 `/opt/local/var/macports/build/_opt_local_var_macports_sources_rsync.macports
 .org_release_tarballs_ports_net_libtorrent-rasterbar/libtorrent-
 rasterbar/work/libtorrent-1_0_6/bindings'
 :info:build Making all in python
 :info:build make[2]: Entering directory
 `/opt/local/var/macports/build/_opt_local_var_macports_sources_rsync.macports
 .org_release_tarballs_ports_net_libtorrent-rasterbar/libtorrent-
 rasterbar/work/libtorrent-1_0_6/bindings/python'
 :info:build /opt/local/bin/python2.7 setup.py build
 :info:build running build
 :info:build running build_ext
 :info:build building 'libtorrent' extension
 :info:build /usr/bin/clang -fno-strict-aliasing -fno-common -dynamic -pipe
 -Os -fwrapv -DNDEBUG -g -fwrapv -O3 -Wall -Wstrict-prototypes
 -I/opt/local/include -I/opt/local/include -I/opt/local/include
 -I/opt/local/include -I../../include
 -I/opt/local/Library/Frameworks/Python.framework/Versions/2.7/include/python2.7
 -c src/alert.cpp -o build/temp.macosx-10.7-x86_64-2.7/src/alert.o
 -DTORRENT_USE_OPENSSL -DBOOST_ASIO_HASH_MAP_BUCKETS=1021
 -DBOOST_EXCEPTION_DISABLE -DBOOST_ASIO_ENABLE_CANCELIO
 -DBOOST_ASIO_DYN_LINK -DTORRENT_LINKING_SHARED
 :info:build src/alert.cpp:107:38: warning: 'severity' is deprecated
 [-Wdeprecated-declarations]
 :info:build             .def("severity", &alert::severity)
 :info:build                                      ^
 :info:build /opt/local/include/libtorrent/alert.hpp:228:14: note:
 'severity' declared here
 :info:build                 severity_t severity() const TORRENT_DEPRECATED
 { return warning; }
 :info:build                            ^
 :info:build In file included from src/alert.cpp:7:
 :info:build In file included from
 /opt/local/include/libtorrent/alert_types.hpp:37:
 :info:build In file included from
 /opt/local/include/libtorrent/torrent_handle.hpp:55:
 :info:build In file included from
 /opt/local/include/libtorrent/torrent_info.hpp:43:
 :info:build In file included from
 /opt/local/include/boost/optional.hpp:15:
 :info:build In file included from
 /opt/local/include/boost/optional/optional.hpp:51:
 :info:build /opt/local/include/boost/none.hpp:45:17: warning: variable
 'none' is not needed and will not be emitted [-Wunneeded-internal-
 declaration]
 :info:build   const none_t& none =
 detail::optional_detail::none_instance<none_t>::instance;
 :info:build                 ^
 :info:build 2 warnings generated.
 :info:build /usr/bin/clang -fno-strict-aliasing -fno-common -dynamic -pipe
 -Os -fwrapv -DNDEBUG -g -fwrapv -O3 -Wall -Wstrict-prototypes
 -I/opt/local/include -I/opt/local/include -I/opt/local/include
 -I/opt/local/include -I../../include
 -I/opt/local/Library/Frameworks/Python.framework/Versions/2.7/include/python2.7
 -c src/big_number.cpp -o
 build/temp.macosx-10.7-x86_64-2.7/src/big_number.o -DTORRENT_USE_OPENSSL
 -DBOOST_ASIO_HASH_MAP_BUCKETS=1021 -DBOOST_EXCEPTION_DISABLE
 -DBOOST_ASIO_ENABLE_CANCELIO -DBOOST_ASIO_DYN_LINK
 -DTORRENT_LINKING_SHARED
 :info:build /usr/bin/clang -fno-strict-aliasing -fno-common -dynamic -pipe
 -Os -fwrapv -DNDEBUG -g -fwrapv -O3 -Wall -Wstrict-prototypes
 -I/opt/local/include -I/opt/local/include -I/opt/local/include
 -I/opt/local/include -I../../include
 -I/opt/local/Library/Frameworks/Python.framework/Versions/2.7/include/python2.7
 -c src/converters.cpp -o
 build/temp.macosx-10.7-x86_64-2.7/src/converters.o -DTORRENT_USE_OPENSSL
 -DBOOST_ASIO_HASH_MAP_BUCKETS=1021 -DBOOST_EXCEPTION_DISABLE
 -DBOOST_ASIO_ENABLE_CANCELIO -DBOOST_ASIO_DYN_LINK
 -DTORRENT_LINKING_SHARED
 :info:build /usr/bin/clang -fno-strict-aliasing -fno-common -dynamic -pipe
 -Os -fwrapv -DNDEBUG -g -fwrapv -O3 -Wall -Wstrict-prototypes
 -I/opt/local/include -I/opt/local/include -I/opt/local/include
 -I/opt/local/include -I../../include
 -I/opt/local/Library/Frameworks/Python.framework/Versions/2.7/include/python2.7
 -c src/create_torrent.cpp -o
 build/temp.macosx-10.7-x86_64-2.7/src/create_torrent.o
 -DTORRENT_USE_OPENSSL -DBOOST_ASIO_HASH_MAP_BUCKETS=1021
 -DBOOST_EXCEPTION_DISABLE -DBOOST_ASIO_ENABLE_CANCELIO
 -DBOOST_ASIO_DYN_LINK -DTORRENT_LINKING_SHARED
 :info:build src/create_torrent.cpp:81:109: warning: 'add_file' is
 deprecated [-Wdeprecated-declarations]
 :info:build     void (file_storage::*add_file1)(std::wstring const&,
 size_type, int, std::time_t, std::string const&) =
 &file_storage::add_file;
 :info:build
 ^
 :info:build /opt/local/include/libtorrent/file_storage.hpp:314:8: note:
 'add_file' declared here
 :info:build                 void add_file(std::wstring const& p, size_type
 size, int flags = 0
 :info:build                      ^
 :info:build src/create_torrent.cpp:87:60: warning: 'set_name' is
 deprecated [-Wdeprecated-declarations]
 :info:build     void (file_storage::*set_name1)(std::wstring const&) =
 &file_storage::set_name;
 :info:build                                                            ^
 :info:build /opt/local/include/libtorrent/file_storage.hpp:319:8: note:
 'set_name' declared here
 :info:build                 void set_name(std::wstring const& n)
 TORRENT_DEPRECATED;
 :info:build                      ^
 :info:build src/create_torrent.cpp:88:68: warning: 'rename_file' is
 deprecated [-Wdeprecated-declarations]
 :info:build     void (file_storage::*rename_file1)(int, std::wstring
 const&) = &file_storage::rename_file;
 :info:build
 ^
 :info:build /opt/local/include/libtorrent/file_storage.hpp:317:8: note:
 'rename_file' declared here
 :info:build                 void rename_file(int index, std::wstring
 const& new_filename) TORRENT_DEPRECATED;
 :info:build                      ^
 :info:build In file included from src/create_torrent.cpp:6:
 :info:build In file included from
 /opt/local/include/libtorrent/create_torrent.hpp:40:
 :info:build In file included from
 /opt/local/include/libtorrent/storage.hpp:54:
 :info:build In file included from
 /opt/local/include/libtorrent/torrent_info.hpp:43:
 :info:build In file included from
 /opt/local/include/boost/optional.hpp:15:
 :info:build In file included from
 /opt/local/include/boost/optional/optional.hpp:51:
 :info:build /opt/local/include/boost/none.hpp:45:17: warning: variable
 'none' is not needed and will not be emitted [-Wunneeded-internal-
 declaration]
 :info:build   const none_t& none =
 detail::optional_detail::none_instance<none_t>::instance;
 :info:build                 ^
 :info:build 4 warnings generated.
 :info:build /usr/bin/clang -fno-strict-aliasing -fno-common -dynamic -pipe
 -Os -fwrapv -DNDEBUG -g -fwrapv -O3 -Wall -Wstrict-prototypes
 -I/opt/local/include -I/opt/local/include -I/opt/local/include
 -I/opt/local/include -I../../include
 -I/opt/local/Library/Frameworks/Python.framework/Versions/2.7/include/python2.7
 -c src/datetime.cpp -o build/temp.macosx-10.7-x86_64-2.7/src/datetime.o
 -DTORRENT_USE_OPENSSL -DBOOST_ASIO_HASH_MAP_BUCKETS=1021
 -DBOOST_EXCEPTION_DISABLE -DBOOST_ASIO_ENABLE_CANCELIO
 -DBOOST_ASIO_DYN_LINK -DTORRENT_LINKING_SHARED
 :info:build In file included from src/datetime.cpp:7:
 :info:build In file included from src/optional.hpp:9:
 :info:build In file included from
 /opt/local/include/boost/optional.hpp:15:
 :info:build In file included from
 /opt/local/include/boost/optional/optional.hpp:51:
 :info:build /opt/local/include/boost/none.hpp:45:17: warning: variable
 'none' is not needed and will not be emitted [-Wunneeded-internal-
 declaration]
 :info:build   const none_t& none =
 detail::optional_detail::none_instance<none_t>::instance;
 :info:build                 ^
 :info:build 1 warning generated.
 :info:build /usr/bin/clang -fno-strict-aliasing -fno-common -dynamic -pipe
 -Os -fwrapv -DNDEBUG -g -fwrapv -O3 -Wall -Wstrict-prototypes
 -I/opt/local/include -I/opt/local/include -I/opt/local/include
 -I/opt/local/include -I../../include
 -I/opt/local/Library/Frameworks/Python.framework/Versions/2.7/include/python2.7
 -c src/entry.cpp -o build/temp.macosx-10.7-x86_64-2.7/src/entry.o
 -DTORRENT_USE_OPENSSL -DBOOST_ASIO_HASH_MAP_BUCKETS=1021
 -DBOOST_EXCEPTION_DISABLE -DBOOST_ASIO_ENABLE_CANCELIO
 -DBOOST_ASIO_DYN_LINK -DTORRENT_LINKING_SHARED
 :info:build In file included from src/entry.cpp:6:
 :info:build In file included from
 /opt/local/include/libtorrent/session.hpp:50:
 :info:build In file included from
 /opt/local/include/libtorrent/torrent_handle.hpp:55:
 :info:build In file included from
 /opt/local/include/libtorrent/torrent_info.hpp:43:
 :info:build In file included from
 /opt/local/include/boost/optional.hpp:15:
 :info:build In file included from
 /opt/local/include/boost/optional/optional.hpp:51:
 :info:build /opt/local/include/boost/none.hpp:45:17: warning: variable
 'none' is not needed and will not be emitted [-Wunneeded-internal-
 declaration]
 :info:build   const none_t& none =
 detail::optional_detail::none_instance<none_t>::instance;
 :info:build                 ^
 :info:build 1 warning generated.
 :info:build /usr/bin/clang -fno-strict-aliasing -fno-common -dynamic -pipe
 -Os -fwrapv -DNDEBUG -g -fwrapv -O3 -Wall -Wstrict-prototypes
 -I/opt/local/include -I/opt/local/include -I/opt/local/include
 -I/opt/local/include -I../../include
 -I/opt/local/Library/Frameworks/Python.framework/Versions/2.7/include/python2.7
 -c src/error_code.cpp -o
 build/temp.macosx-10.7-x86_64-2.7/src/error_code.o -DTORRENT_USE_OPENSSL
 -DBOOST_ASIO_HASH_MAP_BUCKETS=1021 -DBOOST_EXCEPTION_DISABLE
 -DBOOST_ASIO_ENABLE_CANCELIO -DBOOST_ASIO_DYN_LINK
 -DTORRENT_LINKING_SHARED
 :info:build /usr/bin/clang -fno-strict-aliasing -fno-common -dynamic -pipe
 -Os -fwrapv -DNDEBUG -g -fwrapv -O3 -Wall -Wstrict-prototypes
 -I/opt/local/include -I/opt/local/include -I/opt/local/include
 -I/opt/local/include -I../../include
 -I/opt/local/Library/Frameworks/Python.framework/Versions/2.7/include/python2.7
 -c src/fingerprint.cpp -o
 build/temp.macosx-10.7-x86_64-2.7/src/fingerprint.o -DTORRENT_USE_OPENSSL
 -DBOOST_ASIO_HASH_MAP_BUCKETS=1021 -DBOOST_EXCEPTION_DISABLE
 -DBOOST_ASIO_ENABLE_CANCELIO -DBOOST_ASIO_DYN_LINK
 -DTORRENT_LINKING_SHARED
 :info:build /usr/bin/clang -fno-strict-aliasing -fno-common -dynamic -pipe
 -Os -fwrapv -DNDEBUG -g -fwrapv -O3 -Wall -Wstrict-prototypes
 -I/opt/local/include -I/opt/local/include -I/opt/local/include
 -I/opt/local/include -I../../include
 -I/opt/local/Library/Frameworks/Python.framework/Versions/2.7/include/python2.7
 -c src/ip_filter.cpp -o build/temp.macosx-10.7-x86_64-2.7/src/ip_filter.o
 -DTORRENT_USE_OPENSSL -DBOOST_ASIO_HASH_MAP_BUCKETS=1021
 -DBOOST_EXCEPTION_DISABLE -DBOOST_ASIO_ENABLE_CANCELIO
 -DBOOST_ASIO_DYN_LINK -DTORRENT_LINKING_SHARED
 :info:build /usr/bin/clang -fno-strict-aliasing -fno-common -dynamic -pipe
 -Os -fwrapv -DNDEBUG -g -fwrapv -O3 -Wall -Wstrict-prototypes
 -I/opt/local/include -I/opt/local/include -I/opt/local/include
 -I/opt/local/include -I../../include
 -I/opt/local/Library/Frameworks/Python.framework/Versions/2.7/include/python2.7
 -c src/magnet_uri.cpp -o
 build/temp.macosx-10.7-x86_64-2.7/src/magnet_uri.o -DTORRENT_USE_OPENSSL
 -DBOOST_ASIO_HASH_MAP_BUCKETS=1021 -DBOOST_EXCEPTION_DISABLE
 -DBOOST_ASIO_ENABLE_CANCELIO -DBOOST_ASIO_DYN_LINK
 -DTORRENT_LINKING_SHARED
 :info:build In file included from src/magnet_uri.cpp:6:
 :info:build In file included from
 /opt/local/include/libtorrent/session.hpp:50:
 :info:build In file included from
 /opt/local/include/libtorrent/torrent_handle.hpp:55:
 :info:build In file included from
 /opt/local/include/libtorrent/torrent_info.hpp:43:
 :info:build In file included from
 /opt/local/include/boost/optional.hpp:15:
 :info:build In file included from
 /opt/local/include/boost/optional/optional.hpp:51:
 :info:build /opt/local/include/boost/none.hpp:45:17: warning: variable
 'none' is not needed and will not be emitted [-Wunneeded-internal-
 declaration]
 :info:build   const none_t& none =
 detail::optional_detail::none_instance<none_t>::instance;
 :info:build                 ^
 :info:build 1 warning generated.
 :info:build /usr/bin/clang -fno-strict-aliasing -fno-common -dynamic -pipe
 -Os -fwrapv -DNDEBUG -g -fwrapv -O3 -Wall -Wstrict-prototypes
 -I/opt/local/include -I/opt/local/include -I/opt/local/include
 -I/opt/local/include -I../../include
 -I/opt/local/Library/Frameworks/Python.framework/Versions/2.7/include/python2.7
 -c src/module.cpp -o build/temp.macosx-10.7-x86_64-2.7/src/module.o
 -DTORRENT_USE_OPENSSL -DBOOST_ASIO_HASH_MAP_BUCKETS=1021
 -DBOOST_EXCEPTION_DISABLE -DBOOST_ASIO_ENABLE_CANCELIO
 -DBOOST_ASIO_DYN_LINK -DTORRENT_LINKING_SHARED
 :info:build /usr/bin/clang -fno-strict-aliasing -fno-common -dynamic -pipe
 -Os -fwrapv -DNDEBUG -g -fwrapv -O3 -Wall -Wstrict-prototypes
 -I/opt/local/include -I/opt/local/include -I/opt/local/include
 -I/opt/local/include -I../../include
 -I/opt/local/Library/Frameworks/Python.framework/Versions/2.7/include/python2.7
 -c src/peer_info.cpp -o build/temp.macosx-10.7-x86_64-2.7/src/peer_info.o
 -DTORRENT_USE_OPENSSL -DBOOST_ASIO_HASH_MAP_BUCKETS=1021
 -DBOOST_EXCEPTION_DISABLE -DBOOST_ASIO_ENABLE_CANCELIO
 -DBOOST_ASIO_DYN_LINK -DTORRENT_LINKING_SHARED
 :info:build /usr/bin/clang -fno-strict-aliasing -fno-common -dynamic -pipe
 -Os -fwrapv -DNDEBUG -g -fwrapv -O3 -Wall -Wstrict-prototypes
 -I/opt/local/include -I/opt/local/include -I/opt/local/include
 -I/opt/local/include -I../../include
 -I/opt/local/Library/Frameworks/Python.framework/Versions/2.7/include/python2.7
 -c src/session.cpp -o build/temp.macosx-10.7-x86_64-2.7/src/session.o
 -DTORRENT_USE_OPENSSL -DBOOST_ASIO_HASH_MAP_BUCKETS=1021
 -DBOOST_EXCEPTION_DISABLE -DBOOST_ASIO_ENABLE_CANCELIO
 -DBOOST_ASIO_DYN_LINK -DTORRENT_LINKING_SHARED
 :info:build src/session.cpp:82:29: warning: 'create_metadata_plugin' is
 deprecated [-Wdeprecated-declarations]
 :info:build             s.add_extension(create_metadata_plugin);
 :info:build                             ^
 :info:build
 /opt/local/include/libtorrent/extensions/metadata_transfer.hpp:62:2: note:
 'create_metadata_plugin' declared here
 :info:build         create_metadata_plugin(torrent*, void*)
 TORRENT_DEPRECATED;
 :info:build         ^
 :info:build src/session.cpp:175:18: warning: 'add_torrent' is deprecated
 [-Wdeprecated-declarations]
 :info:build         return s.add_torrent(ti, save, resume, storage_mode,
 paused, default_storage_constructor);
 :info:build                  ^
 :info:build /opt/local/include/libtorrent/session.hpp:352:18: note:
 'add_torrent' declared here
 :info:build                 torrent_handle add_torrent(
 :info:build                                ^
 :info:build src/session.cpp:510:49: warning: 'start_dht' is deprecated
 [-Wdeprecated-declarations]
 :info:build     void (session::*start_dht1)(entry const&) =
 &session::start_dht;
 :info:build                                                 ^
 :info:build /opt/local/include/libtorrent/session.hpp:575:8: note:
 'start_dht' declared here
 :info:build                 void start_dht(entry const& startup_state)
 TORRENT_DEPRECATED;
 :info:build                      ^
 :info:build src/session.cpp:660:58: error: no member named
 'get_dht_settings' in 'libtorrent::session'; did you mean
 'set_dht_settings'?
 :info:build         .def("get_dht_settings",
 allow_threads(&session::get_dht_settings))
 :info:build
 ~~~~~~~~~^~~~~~~~~~~~~~~~
 :info:build
 set_dht_settings
 :info:build /opt/local/include/libtorrent/session.hpp:489:8: note:
 'set_dht_settings' declared here
 :info:build                 void set_dht_settings(dht_settings const&
 settings);
 :info:build                      ^
 :info:build src/session.cpp:665:51: warning: 'dht_state' is deprecated
 [-Wdeprecated-declarations]
 :info:build         .def("dht_state", allow_threads(&session::dht_state))
 :info:build                                                   ^
 :info:build /opt/local/include/libtorrent/session.hpp:573:9: note:
 'dht_state' declared here
 :info:build                 entry dht_state() const TORRENT_DEPRECATED;
 :info:build                       ^
 :info:build src/session.cpp:666:55: warning: 'set_dht_proxy' is deprecated
 [-Wdeprecated-declarations]
 :info:build         .def("set_dht_proxy",
 allow_threads(&session::set_dht_proxy))
 :info:build                                                       ^
 :info:build /opt/local/include/libtorrent/session.hpp:884:8: note:
 'set_dht_proxy' declared here
 :info:build                 void set_dht_proxy(proxy_settings const& s)
 TORRENT_DEPRECATED;
 :info:build                      ^
 :info:build src/session.cpp:667:51: warning: 'dht_proxy' is deprecated
 [-Wdeprecated-declarations]
 :info:build         .def("dht_proxy", allow_threads(&session::dht_proxy))
 :info:build                                                   ^
 :info:build /opt/local/include/libtorrent/session.hpp:886:18: note:
 'dht_proxy' declared here
 :info:build                 proxy_settings dht_proxy() const
 TORRENT_DEPRECATED;
 :info:build                                ^
 :info:build src/session.cpp:687:71: warning:
 'set_local_download_rate_limit' is deprecated [-Wdeprecated-declarations]
 :info:build         .def("set_local_download_rate_limit",
 allow_threads(&session::set_local_download_rate_limit))
 :info:build
 ^
 :info:build /opt/local/include/libtorrent/session.hpp:903:8: note:
 'set_local_download_rate_limit' declared here
 :info:build                 void set_local_download_rate_limit(int
 bytes_per_second) TORRENT_DEPRECATED;
 :info:build                      ^
 :info:build src/session.cpp:688:67: warning: 'local_download_rate_limit'
 is deprecated [-Wdeprecated-declarations]
 :info:build         .def("local_download_rate_limit",
 allow_threads(&session::local_download_rate_limit))
 :info:build
 ^
 :info:build /opt/local/include/libtorrent/session.hpp:896:7: note:
 'local_download_rate_limit' declared here
 :info:build                 int local_download_rate_limit() const
 TORRENT_DEPRECATED;
 :info:build                     ^
 :info:build src/session.cpp:690:69: warning: 'set_local_upload_rate_limit'
 is deprecated [-Wdeprecated-declarations]
 :info:build         .def("set_local_upload_rate_limit",
 allow_threads(&session::set_local_upload_rate_limit))
 :info:build
 ^
 :info:build /opt/local/include/libtorrent/session.hpp:901:8: note:
 'set_local_upload_rate_limit' declared here
 :info:build                 void set_local_upload_rate_limit(int
 bytes_per_second) TORRENT_DEPRECATED;
 :info:build                      ^
 :info:build src/session.cpp:691:65: warning: 'local_upload_rate_limit' is
 deprecated [-Wdeprecated-declarations]
 :info:build         .def("local_upload_rate_limit",
 allow_threads(&session::local_upload_rate_limit))
 :info:build
 ^
 :info:build /opt/local/include/libtorrent/session.hpp:894:7: note:
 'local_upload_rate_limit' declared here
 :info:build                 int local_upload_rate_limit() const
 TORRENT_DEPRECATED;
 :info:build                     ^
 :info:build src/session.cpp:693:65: warning: 'set_download_rate_limit' is
 deprecated [-Wdeprecated-declarations]
 :info:build         .def("set_download_rate_limit",
 allow_threads(&session::set_download_rate_limit))
 :info:build
 ^
 :info:build /opt/local/include/libtorrent/session.hpp:907:8: note:
 'set_download_rate_limit' declared here
 :info:build                 void set_download_rate_limit(int
 bytes_per_second) TORRENT_DEPRECATED;
 :info:build                      ^
 :info:build src/session.cpp:694:61: warning: 'download_rate_limit' is
 deprecated [-Wdeprecated-declarations]
 :info:build         .def("download_rate_limit",
 allow_threads(&session::download_rate_limit))
 :info:build                                                             ^
 :info:build /opt/local/include/libtorrent/session.hpp:892:7: note:
 'download_rate_limit' declared here
 :info:build                 int download_rate_limit() const
 TORRENT_DEPRECATED;
 :info:build                     ^
 :info:build src/session.cpp:696:63: warning: 'set_upload_rate_limit' is
 deprecated [-Wdeprecated-declarations]
 :info:build         .def("set_upload_rate_limit",
 allow_threads(&session::set_upload_rate_limit))
 :info:build
 ^
 :info:build /opt/local/include/libtorrent/session.hpp:905:8: note:
 'set_upload_rate_limit' declared here
 :info:build                 void set_upload_rate_limit(int
 bytes_per_second) TORRENT_DEPRECATED;
 :info:build                      ^
 :info:build src/session.cpp:697:59: warning: 'upload_rate_limit' is
 deprecated [-Wdeprecated-declarations]
 :info:build         .def("upload_rate_limit",
 allow_threads(&session::upload_rate_limit))
 :info:build                                                           ^
 :info:build /opt/local/include/libtorrent/session.hpp:890:7: note:
 'upload_rate_limit' declared here
 :info:build                 int upload_rate_limit() const
 TORRENT_DEPRECATED;
 :info:build                     ^
 :info:build src/session.cpp:699:57: warning: 'set_max_uploads' is
 deprecated [-Wdeprecated-declarations]
 :info:build         .def("set_max_uploads",
 allow_threads(&session::set_max_uploads))
 :info:build                                                         ^
 :info:build /opt/local/include/libtorrent/session.hpp:909:8: note:
 'set_max_uploads' declared here
 :info:build                 void set_max_uploads(int limit)
 TORRENT_DEPRECATED;
 :info:build                      ^
 :info:build src/session.cpp:700:61: warning: 'set_max_connections' is
 deprecated [-Wdeprecated-declarations]
 :info:build         .def("set_max_connections",
 allow_threads(&session::set_max_connections))
 :info:build                                                             ^
 :info:build /opt/local/include/libtorrent/session.hpp:911:8: note:
 'set_max_connections' declared here
 :info:build                 void set_max_connections(int limit)
 TORRENT_DEPRECATED;
 :info:build                      ^
 :info:build src/session.cpp:701:57: warning: 'max_connections' is
 deprecated [-Wdeprecated-declarations]
 :info:build         .def("max_connections",
 allow_threads(&session::max_connections))
 :info:build                                                         ^
 :info:build /opt/local/include/libtorrent/session.hpp:916:7: note:
 'max_connections' declared here
 :info:build                 int max_connections() const
 TORRENT_DEPRECATED;
 :info:build                     ^
 :info:build src/session.cpp:702:71: warning:
 'set_max_half_open_connections' is deprecated [-Wdeprecated-declarations]
 :info:build         .def("set_max_half_open_connections",
 allow_threads(&session::set_max_half_open_connections))
 :info:build
 ^
 :info:build /opt/local/include/libtorrent/session.hpp:913:8: note:
 'set_max_half_open_connections' declared here
 :info:build                 void set_max_half_open_connections(int limit)
 TORRENT_DEPRECATED;
 :info:build                      ^
 :info:build src/session.cpp:703:57: warning: 'num_connections' is
 deprecated [-Wdeprecated-declarations]
 :info:build         .def("num_connections",
 allow_threads(&session::num_connections))
 :info:build                                                         ^
 :info:build /opt/local/include/libtorrent/session.hpp:866:7: note:
 'num_connections' declared here
 :info:build                 int num_connections() const
 TORRENT_DEPRECATED;
 :info:build                     ^
 :info:build src/session.cpp:723:60: warning: 'set_severity_level' is
 deprecated [-Wdeprecated-declarations]
 :info:build         .def("set_severity_level",
 allow_threads(&session::set_severity_level))
 :info:build                                                            ^
 :info:build /opt/local/include/libtorrent/session.hpp:978:8: note:
 'set_severity_level' declared here
 :info:build                 void set_severity_level(alert::severity_t s)
 TORRENT_DEPRECATED;
 :info:build                      ^
 :info:build src/session.cpp:724:68: warning: 'set_alert_queue_size_limit'
 is deprecated [-Wdeprecated-declarations]
 :info:build         .def("set_alert_queue_size_limit",
 allow_threads(&session::set_alert_queue_size_limit))
 :info:build
 ^
 :info:build /opt/local/include/libtorrent/session.hpp:981:10: note:
 'set_alert_queue_size_limit' declared here
 :info:build                 size_t set_alert_queue_size_limit(size_t
 queue_size_limit_) TORRENT_DEPRECATED;
 :info:build                        ^
 :info:build src/session.cpp:732:56: warning: 'set_peer_proxy' is
 deprecated [-Wdeprecated-declarations]
 :info:build         .def("set_peer_proxy",
 allow_threads(&session::set_peer_proxy))
 :info:build                                                        ^
 :info:build /opt/local/include/libtorrent/session.hpp:870:8: note:
 'set_peer_proxy' declared here
 :info:build                 void set_peer_proxy(proxy_settings const& s)
 TORRENT_DEPRECATED;
 :info:build                      ^
 :info:build src/session.cpp:733:59: warning: 'set_tracker_proxy' is
 deprecated [-Wdeprecated-declarations]
 :info:build         .def("set_tracker_proxy",
 allow_threads(&session::set_tracker_proxy))
 :info:build                                                           ^
 :info:build /opt/local/include/libtorrent/session.hpp:874:8: note:
 'set_tracker_proxy' declared here
 :info:build                 void set_tracker_proxy(proxy_settings const&
 s) TORRENT_DEPRECATED;
 :info:build                      ^
 :info:build src/session.cpp:734:60: warning: 'set_web_seed_proxy' is
 deprecated [-Wdeprecated-declarations]
 :info:build         .def("set_web_seed_proxy",
 allow_threads(&session::set_web_seed_proxy))
 :info:build                                                            ^
 :info:build /opt/local/include/libtorrent/session.hpp:872:8: note:
 'set_web_seed_proxy' declared here
 :info:build                 void set_web_seed_proxy(proxy_settings const&
 s) TORRENT_DEPRECATED;
 :info:build                      ^
 :info:build src/session.cpp:735:52: warning: 'peer_proxy' is deprecated
 [-Wdeprecated-declarations]
 :info:build         .def("peer_proxy",
 allow_threads(&session::peer_proxy))
 :info:build                                                    ^
 :info:build /opt/local/include/libtorrent/session.hpp:877:18: note:
 'peer_proxy' declared here
 :info:build                 proxy_settings peer_proxy() const
 TORRENT_DEPRECATED;
 :info:build                                ^
 :info:build src/session.cpp:736:55: warning: 'tracker_proxy' is deprecated
 [-Wdeprecated-declarations]
 :info:build         .def("tracker_proxy",
 allow_threads(&session::tracker_proxy))
 :info:build                                                       ^
 :info:build /opt/local/include/libtorrent/session.hpp:881:18: note:
 'tracker_proxy' declared here
 :info:build                 proxy_settings tracker_proxy() const
 TORRENT_DEPRECATED;
 :info:build                                ^
 :info:build src/session.cpp:737:56: warning: 'web_seed_proxy' is
 deprecated [-Wdeprecated-declarations]
 :info:build         .def("web_seed_proxy",
 allow_threads(&session::web_seed_proxy))
 :info:build                                                        ^
 :info:build /opt/local/include/libtorrent/session.hpp:879:18: note:
 'web_seed_proxy' declared here
 :info:build                 proxy_settings web_seed_proxy() const
 TORRENT_DEPRECATED;
 :info:build                                ^
 :info:build 27 warnings and 1 error generated.
 :info:build error: command '/usr/bin/clang' failed with exit status 1
 :info:build make[2]: *** [all-local] Error 1
 :info:build make[2]: Leaving directory
 `/opt/local/var/macports/build/_opt_local_var_macports_sources_rsync.macports
 .org_release_tarballs_ports_net_libtorrent-rasterbar/libtorrent-
 rasterbar/work/libtorrent-1_0_6/bindings/python'
 :info:build make[1]: *** [all-recursive] Error 1
 :info:build make[1]: Leaving directory
 `/opt/local/var/macports/build/_opt_local_var_macports_sources_rsync.macports
 .org_release_tarballs_ports_net_libtorrent-rasterbar/libtorrent-
 rasterbar/work/libtorrent-1_0_6/bindings'
 :info:build make: *** [all-recursive] Error 1
 :info:build make: Leaving directory
 `/opt/local/var/macports/build/_opt_local_var_macports_sources_rsync.macports
 .org_release_tarballs_ports_net_libtorrent-rasterbar/libtorrent-
 rasterbar/work/libtorrent-1_0_6'
 :info:build Command failed:  cd
 "/opt/local/var/macports/build/_opt_local_var_macports_sources_rsync.macports
 .org_release_tarballs_ports_net_libtorrent-rasterbar/libtorrent-
 rasterbar/work/libtorrent-1_0_6" && /usr/bin/make -j4 -w all
 :info:build Exit code: 2
 :error:build org.macports.build for port libtorrent-rasterbar returned:
 command execution failed
 :debug:build Error code: CHILDSTATUS 44787 2
 :debug:build Backtrace: command execution failed
     while executing
 "system -nice 0 $fullcmdstring"
     ("eval" body line 1)
     invoked from within
 "eval system $notty $nice \$fullcmdstring"
     invoked from within
 "command_exec build"
     (procedure "portbuild::build_main" line 8)
     invoked from within
 "portbuild::build_main org.macports.build"
     ("eval" body line 1)
     invoked from within
 "eval $procedure $targetname"
 :info:build Warning: targets not executed for libtorrent-rasterbar:
 org.macports.install org.macports.build org.macports.destroot
 :notice:build Please see the log file for port libtorrent-rasterbar for
 details:
 /opt/local/var/macports/logs/_opt_local_var_macports_sources_rsync.macports
 .org_release_tarballs_ports_net_libtorrent-rasterbar/libtorrent-
 rasterbar/main.log

-- 
Ticket URL: <https://trac.macports.org/ticket/49057>
MacPorts <https://www.macports.org/>
Ports system for OS X


More information about the macports-tickets mailing list