[MacPorts] #69231: kde4-runtime build fails
MacPorts
noreply at macports.org
Mon Jan 29 16:06:34 UTC 2024
#69231: kde4-runtime build fails
--------------------------+--------------------------
Reporter: ShadSterling | Owner: (none)
Type: defect | Status: new
Priority: High | Milestone:
Component: ports | Version: 2.9.0
Keywords: | Port: kde4-runtime
--------------------------+--------------------------
I'm not sure I understand the logs of this, but it looks like there's a
build step that's crashing
{{{
:info:build make[2]: Leaving directory
`/opt/local/var/macports/build/_opt_local_var_macports_sources_rsync.macports.org_macports_release_tarballs_ports_kde_kdelibs4/kdelibs4/work/build'
:info:build /Library/Developer/CommandLineTools/usr/bin/make -f
kde3support/kunittest/CMakeFiles/kunittestmodrunner.dir/build.make
kde3support/kunittest/CMakeFiles/kunittestmodrunner.dir/build
:info:build /bin/sh: line 1: 3404 Segmentation fault: 11
/opt/local/bin/onto2vocabularyclass --name NDO --encoding trig --namespace
Nepomuk::Vocabulary --export-module nepomuk
/opt/local/share/ontology/nepomuk/ndo.trig
:info:build /bin/sh: line 1: 3397 Segmentation fault: 11
/opt/local/bin/onto2vocabularyclass --name NCAL --encoding trig
--namespace Nepomuk::Vocabulary --export-module nepomuk
/opt/local/share/ontology/nie/ncal.trig
:info:build make[2]: *** [nepomuk/ndo.h] Error 139
:info:build make[2]: *** Waiting for unfinished jobs....
:info:build /Library/Developer/CommandLineTools/usr/bin/make -f
kross/test/CMakeFiles/krosstest.dir/build.make
kross/test/CMakeFiles/krosstest.dir/depend
:info:build /bin/sh: line 1: 3391 Segmentation fault: 11
/opt/local/bin/onto2vocabularyclass --name TMO --encoding trig --namespace
Nepomuk::Vocabulary --export-module nepomuk
/opt/local/share/ontology/pimo/tmo.trig
:info:build make[2]: *** [nepomuk/ncal.h] Error 139
:info:build make[2]: *** [nepomuk/tmo.h] Error 139
:info:build make[2]: Entering directory
`/opt/local/var/macports/build/_opt_local_var_macports_sources_rsync.macports.org_macports_release_tarballs_ports_kde_kdelibs4/kdelibs4/work/build'
:info:build make[2]: Nothing to be done for
`kde3support/kunittest/CMakeFiles/kunittestmodrunner.dir/build'.
:info:build /Library/Developer/CommandLineTools/usr/bin/make -f
kross/kjs/CMakeFiles/krosskjs.dir/build.make
kross/kjs/CMakeFiles/krosskjs.dir/depend
:info:build make[2]: Leaving directory
`/opt/local/var/macports/build/_opt_local_var_macports_sources_rsync.macports.org_macports_release_tarballs_ports_kde_kdelibs4/kdelibs4/work/build'
:info:build /Library/Developer/CommandLineTools/usr/bin/make -f
kross/qts/CMakeFiles/krossqtsplugin.dir/build.make
kross/qts/CMakeFiles/krossqtsplugin.dir/depend
:info:build /bin/sh: line 1: 3406 Segmentation fault: 11
/opt/local/bin/onto2vocabularyclass --name NEXIF --encoding trig
--namespace Nepomuk::Vocabulary --export-module nepomuk
/opt/local/share/ontology/nie/nexif.trig
:info:build make[2]: *** [nepomuk/nexif.h] Error 139
:info:build /Library/Developer/CommandLineTools/usr/bin/make -f
kross/qts/CMakeFiles/krossqts.dir/build.make
kross/qts/CMakeFiles/krossqts.dir/depend
:info:build /bin/sh: line 1: 3400 Segmentation fault: 11
/opt/local/bin/onto2vocabularyclass --name NCO --encoding trig --namespace
Nepomuk::Vocabulary --export-module nepomuk
/opt/local/share/ontology/nie/nco.trig
:info:build make[2]: *** [nepomuk/nco.h] Error 139
:info:build /Library/Developer/CommandLineTools/usr/bin/make -f
experimental/libkdeclarative/CMakeFiles/kdeclarativetest.dir/build.make
experimental/libkdeclarative/CMakeFiles/kdeclarativetest.dir/depend
}}}
{{{
:info:build make[2]: Leaving directory
`/opt/local/var/macports/build/_opt_local_var_macports_sources_rsync.macports.org_macports_release_tarballs_ports_kde_kdelibs4/kdelibs4/work/build'
:info:build /Library/Developer/CommandLineTools/usr/bin/make -f
kconf_update/CMakeFiles/kconf_update.dir/build.make
kconf_update/CMakeFiles/kconf_update.dir/build
:info:build /bin/sh: line 1: 3414 Segmentation fault: 11
/opt/local/bin/onto2vocabularyclass --name NFO --encoding trig --namespace
Nepomuk::Vocabulary --export-module nepomuk
/opt/local/share/ontology/nie/nfo.trig
:info:build make[2]: *** [nepomuk/nfo.h] Error 139
}}}
{{{
:info:build make[2]: Leaving directory
`/opt/local/var/macports/build/_opt_local_var_macports_sources_rsync.macports.org_macports_release_tarballs_ports_kde_kdelibs4/kdelibs4/work/build'
:info:build /bin/sh: line 1: 3442 Segmentation fault: 11
/opt/local/bin/onto2vocabularyclass --name NIE --encoding trig --namespace
Nepomuk::Vocabulary --export-module nepomuk
/opt/local/share/ontology/nie/nie.trig
:info:build make[2]: *** [nepomuk/nie.h] Error 139
:info:build /bin/sh: line 1: 3448 Segmentation fault: 11
/opt/local/bin/onto2vocabularyclass --name NMO --encoding trig --namespace
Nepomuk::Vocabulary --export-module nepomuk
/opt/local/share/ontology/nie/nmo.trig
:info:build make[2]: *** [nepomuk/nmo.h] Error 139
:info:build [ 53%] Built target httpauthenticationtest
:info:build /bin/sh: line 1: 3444 Segmentation fault: 11
/opt/local/bin/onto2vocabularyclass --name NMM --encoding trig --namespace
Nepomuk::Vocabulary --export-module nepomuk
/opt/local/share/ontology/nie/nmm.trig
:info:build [ 53%] Built target kross
:info:build make[2]: *** [nepomuk/nmm.h] Error 139
:info:build [ 54%] Built target krossqtsplugin
:info:build /Library/Developer/CommandLineTools/usr/bin/make -f
kross/qts/CMakeFiles/krossqtstest.dir/build.make
kross/qts/CMakeFiles/krossqtstest.dir/depend
:info:build make[2]: Entering directory
`/opt/local/var/macports/build/_opt_local_var_macports_sources_rsync.macports.org_macports_release_tarballs_ports_kde_kdelibs4/kdelibs4/work/build'
:info:build cd
/opt/local/var/macports/build/_opt_local_var_macports_sources_rsync.macports.org_macports_release_tarballs_ports_kde_kdelibs4/kdelibs4/work/build
&& /opt/local/bin/cmake -E cmake_depends "Unix Makefiles"
/opt/local/var/macports/build/_opt_local_var_macports_sources_rsync.macports.org_macports_release_tarballs_ports_kde_kdelibs4/kdelibs4/work/kdelibs-4.14.3
/opt/local/var/macports/build/_opt_local_var_macports_sources_rsync.macports.org_macports_release_tarballs_ports_kde_kdelibs4/kdelibs4/work/kdelibs-4.14.3/kross/qts
/opt/local/var/macports/build/_opt_local_var_macports_sources_rsync.macports.org_macports_release_tarballs_ports_kde_kdelibs4/kdelibs4/work/build
/opt/local/var/macports/build/_opt_local_var_macports_sources_rsync.macports.org_macports_release_tarballs_ports_kde_kdelibs4/kdelibs4/work/build/kross/qts
/opt/local/var/macports/build/_opt_local_var_macports_sources_rsync.macports.org_macports_release_tarballs_ports_kde_kdelibs4/kdelibs4/work/build/kross/qts/CMakeFiles/krossqtstest.dir/DependInfo.cmake
--color=
:info:build /bin/sh: line 1: 3469 Segmentation fault: 11
/opt/local/bin/onto2vocabularyclass --name NUAO --encoding trig
--namespace Nepomuk::Vocabulary --export-module nepomuk
/opt/local/share/ontology/nepomuk/nuao.trig
:info:build make[2]: *** [nepomuk/nuao.h] Error 139
:info:build /bin/sh: line 1: 3470 Segmentation fault: 11
/opt/local/bin/onto2vocabularyclass --name PIMO --encoding trig
--namespace Nepomuk::Vocabulary --export-module nepomuk
/opt/local/share/ontology/pimo/pimo.trig
:info:build make[2]: *** [nepomuk/pimo.h] Error 139
:info:build make[2]: Leaving directory
`/opt/local/var/macports/build/_opt_local_var_macports_sources_rsync.macports.org_macports_release_tarballs_ports_kde_kdelibs4/kdelibs4/work/build'
:info:build make[1]: *** [nepomuk/CMakeFiles/nepomuk.dir/all] Error 2
}}}
--
Ticket URL: <https://trac.macports.org/ticket/69231>
MacPorts <https://www.macports.org/>
Ports system for macOS
More information about the macports-tickets
mailing list