[MacPorts] #74278: memcached @1.5.22: xsltproc: protocol-binary-range.xml:117: namespace error : Namespace prefix x for sec on xref is not defined (was: memcached @1.5.22: xml2rfc: error: unrecognized arguments: protocol-binary-range.txt)
MacPorts
noreply at macports.org
Sat Aug 1 00:11:29 UTC 2026
#74278: memcached @1.5.22: xsltproc: protocol-binary-range.xml:117: namespace error
: Namespace prefix x for sec on xref is not defined
--------------------------+--------------------
Reporter: cooljeanius | Owner: (none)
Type: defect | Status: new
Priority: Normal | Milestone:
Component: ports | Version: 2.12.5
Resolution: | Keywords:
Port: memcached |
--------------------------+--------------------
Description changed by cooljeanius:
Old description:
> {{{
> Making all in doc
> make[2]: Entering directory `/opt/local/var/macports/build/memcached-
> e82d7bcf/work/memcached-1.5.22/doc'
> /opt/local/bin/xml2rfc -d ./xml2rfc/rfc2629.dtd -c . protocol-binary.full
> protocol-binary.txt
> /opt/local/bin/xml2rfc -d ./xml2rfc/rfc2629.dtd -c . protocol-binary-
> range.full protocol-binary-range.txt
> usage: xml2rfc [OPTIONS] SOURCE [OPTIONS]...
> Example: xml2rfc draft.xml -b draft-foo-19 --text --html
> usage: xml2rfc [OPTIONS] SOURCE [OPTIONS]...
> Example: xml2rfc draft.xml -b draft-foo-19 --text --html
> xml2rfc: error: unrecognized arguments: protocol-binary-range.txt
> xml2rfc: error: unrecognized arguments: protocol-binary.txt
> make[2]: *** [protocol-binary.txt] Error 2
> make[2]: *** Waiting for unfinished jobs....
> make[2]: *** [protocol-binary-range.txt] Error 2
> make[2]: Leaving directory `/opt/local/var/macports/build/memcached-
> e82d7bcf/work/memcached-1.5.22/doc'
> make[1]: *** [all-recursive] Error 1
> make[1]: Leaving directory `/opt/local/var/macports/build/memcached-
> e82d7bcf/work/memcached-1.5.22'
> make: *** [all] Error 2
> make: Leaving directory `/opt/local/var/macports/build/memcached-
> e82d7bcf/work/memcached-1.5.22'
> Command failed: cd "/opt/local/var/macports/build/memcached-
> e82d7bcf/work/memcached-1.5.22" && /usr/bin/make -j16 -w all
> Exit code: 2
> Error: Failed to build memcached: command execution failed
> DEBUG: Error code: CHILDSTATUS 49754 2
> }}}
> I'm on x86_64 Tahoe.
New description:
{{{
Making all in doc
make[2]: Entering directory `/opt/local/var/macports/build/memcached-
e82d7bcf/work/memcached-1.5.22/doc'
/opt/local/bin/xsltproc --nonet ./xml2rfc/rfc2629-noinc.xsl protocol-
binary.xml > protocol-binary.full
/opt/local/bin/xsltproc --nonet ./xml2rfc/rfc2629-noinc.xsl protocol-
binary-range.xml > protocol-binary-range.full
protocol-binary-range.xml:117: namespace error : Namespace prefix x for
sec on xref is not defined
<xref target="MEMCACHE" x:sec="command-get"/>.
^
protocol-binary-range.xml:210: namespace error : Namespace prefix x for
sec on xref is not defined
beyond those discussed in <xref target="MEMCACHE"
x:sec="security"/>.
^
/opt/local/bin/xml2rfc -d ./xml2rfc/rfc2629.dtd -c . protocol-binary-
range.full protocol-binary-range.txt
/opt/local/bin/xml2rfc -d ./xml2rfc/rfc2629.dtd -c . protocol-binary.full
protocol-binary.txt
usage: xml2rfc [OPTIONS] SOURCE [OPTIONS]...
Example: xml2rfc draft.xml -b draft-foo-19 --text --html
xml2rfc: error: unrecognized arguments: protocol-binary-range.txt
usage: xml2rfc [OPTIONS] SOURCE [OPTIONS]...
Example: xml2rfc draft.xml -b draft-foo-19 --text --html
xml2rfc: error: unrecognized arguments: protocol-binary.txt
make[2]: *** [protocol-binary.txt] Error 2
make[2]: *** Waiting for unfinished jobs....
make[2]: *** [protocol-binary-range.txt] Error 2
make[2]: Leaving directory `/opt/local/var/macports/build/memcached-
e82d7bcf/work/memcached-1.5.22/doc'
make[1]: *** [all-recursive] Error 1
make[1]: Leaving directory `/opt/local/var/macports/build/memcached-
e82d7bcf/work/memcached-1.5.22'
make: *** [all] Error 2
make: Leaving directory `/opt/local/var/macports/build/memcached-
e82d7bcf/work/memcached-1.5.22'
Command failed: cd "/opt/local/var/macports/build/memcached-
e82d7bcf/work/memcached-1.5.22" && /usr/bin/make -j16 -w all
Exit code: 2
Error: Failed to build memcached: command execution failed
DEBUG: Error code: CHILDSTATUS 54251 2
}}}
I'm on x86_64 Tahoe.
--
--
Ticket URL: <https://trac.macports.org/ticket/74278#comment:1>
MacPorts <https://www.macports.org/>
Ports system for macOS
More information about the macports-tickets
mailing list