[MacPorts] #74311: rockdb: build failure port/mmap.cc
MacPorts
noreply at macports.org
Tue Aug 11 09:22:30 UTC 2026
#74311: rockdb: build failure port/mmap.cc
------------------------+--------------------
Reporter: examachine | Owner: (none)
Type: defect | Status: new
Priority: Normal | Milestone:
Component: ports | Version:
Keywords: | Port:
------------------------+--------------------
Compiler compatibility problem? Please advise.
{{{
Mac OS:
% clang++ --version
Apple clang version 21.0.0 (clang-2100.1.1.101)
Target: arm64-apple-darwin25.5.0
Thread model: posix
InstalledDir: /Library/Developer/CommandLineTools/usr/bin
% head
/opt/local/var/macports/logs/_opt_local_var_macports_sources_rsync.macports.org_macports_release_tarballs_ports_databases_rocksdb/rocksdb/main.log
version:1
:debug:main Starting logging for rocksdb @10.1.3_1
:debug:sysinfo macOS 26.5.1 (darwin/25.5.0) arch arm
:debug:sysinfo MacPorts 2.12.5
:debug:sysinfo Xcode none, CLT 26.6.0.0.1781586589
:debug:sysinfo SDK 26
:debug:sysinfo MACOSX_DEPLOYMENT_TARGET: 26.0
:msg:main ---> Upgrading already installed dependencies of rocksdb
:debug:main epoch: in tree: 0 installed: 0
:debug:main gflags 2.2.2_3 exists in the ports tree
% tail -50
/opt/local/var/macports/logs/_opt_local_var_macports_sources_rsync.macports.org_macports_release_tarballs_ports_databases_rocksdb/rocksdb/main.log
:info:build /usr/bin/clang++ -DBZIP2 -DGFLAGS=1 -DGFLAGS_IS_A_DLL=0
-DHAVE_FULLFSYNC -DLZ4 -DOS_MACOSX -DROCKSDB_LIB_IO_POSIX
-DROCKSDB_NO_DYNAMIC_EXTENSION -DROCKSDB_PLATFORM_POSIX -DSNAPPY -DZLIB
-DZSTD -Drocksdb_shared_EXPORTS -I/opt/local/var/macports/build/rocksdb-
d32946fd/work/rocksdb-10.1.3/include -I/opt/local/var/macports/build
/rocksdb-d32946fd/work/rocksdb-10.1.3 -isystem
/opt/local/var/macports/build/rocksdb-d32946fd/work/rocksdb-10.1.3/third-
party/gtest-1.8.1/fused-src -isystem /opt/local/include -pipe -Os -DNDEBUG
-I/opt/local/include -stdlib=libc++
-isysroot/Library/Developer/CommandLineTools/SDKs/MacOSX26.sdk -W -Wextra
-Wall -pthread -Wsign-compare -Wshadow -Wno-unused-parameter -Wno-unused-
variable -Woverloaded-virtual -Wnon-virtual-dtor -Wno-missing-field-
initializers -Wno-strict-aliasing -Wno-invalid-offsetof -fno-omit-frame-
pointer -momit-leaf-frame-pointer -march=armv8-a+crc+crypto -Wno-unused-
function -Werror -std=gnu++17 -arch arm64 -isysroot
/Library/Developer/CommandLineTools/SDKs/MacOSX26.sdk -mmacosx-version-
min=26.0 -fPIC -MD -MT CMakeFiles/rocksdb-shared.dir/port/stack_trace.cc.o
-MF CMakeFiles/rocksdb-shared.dir/port/stack_trace.cc.o.d -o CMakeFiles
/rocksdb-shared.dir/port/stack_trace.cc.o -c /opt/local/var/macports/build
/rocksdb-d32946fd/work/rocksdb-10.1.3/port/stack_trace.cc
:info:build /opt/local/var/macports/build/rocksdb-
d32946fd/work/rocksdb-10.1.3/port/mmap.cc:50:15: error: first argument in
call to 'memcpy' is a pointer to non-trivially copyable type
'rocksdb::MemMapping' [-Werror,-Wnontrivial-memcall]
:info:build 50 | std::memcpy(this, &other, sizeof(*this));
:info:build | ^
:info:build /opt/local/var/macports/build/rocksdb-
d32946fd/work/rocksdb-10.1.3/port/mmap.cc:50:15: note: explicitly cast the
pointer to silence this warning
:info:build 50 | std::memcpy(this, &other, sizeof(*this));
:info:build | ^
:info:build | (void*)
:info:build 1 error generated.
:info:build make[2]: *** [CMakeFiles/rocksdb-shared.dir/port/mmap.cc.o]
Error 1
:info:build make[2]: *** Waiting for unfinished jobs....
:info:build [ 45%] Building CXX object
CMakeFiles/rocksdb.dir/options/options_helper.cc.o
:info:build /usr/bin/clang++ -DBZIP2 -DGFLAGS=1 -DGFLAGS_IS_A_DLL=0
-DHAVE_FULLFSYNC -DLZ4 -DOS_MACOSX -DROCKSDB_LIB_IO_POSIX
-DROCKSDB_NO_DYNAMIC_EXTENSION -DROCKSDB_PLATFORM_POSIX -DSNAPPY -DZLIB
-DZSTD -I/opt/local/var/macports/build/rocksdb-
d32946fd/work/rocksdb-10.1.3/include -I/opt/local/var/macports/build
/rocksdb-d32946fd/work/rocksdb-10.1.3 -isystem
/opt/local/var/macports/build/rocksdb-d32946fd/work/rocksdb-10.1.3/third-
party/gtest-1.8.1/fused-src -isystem /opt/local/include -pipe -Os -DNDEBUG
-I/opt/local/include -stdlib=libc++
-isysroot/Library/Developer/CommandLineTools/SDKs/MacOSX26.sdk -W -Wextra
-Wall -pthread -Wsign-compare -Wshadow -Wno-unused-parameter -Wno-unused-
variable -Woverloaded-virtual -Wnon-virtual-dtor -Wno-missing-field-
initializers -Wno-strict-aliasing -Wno-invalid-offsetof -fno-omit-frame-
pointer -momit-leaf-frame-pointer -march=armv8-a+crc+crypto -Wno-unused-
function -Werror -std=gnu++17 -arch arm64 -isysroot
/Library/Developer/CommandLineTools/SDKs/MacOSX26.sdk -mmacosx-version-
min=26.0 -MD -MT CMakeFiles/rocksdb.dir/options/options_helper.cc.o -MF
CMakeFiles/rocksdb.dir/options/options_helper.cc.o.d -o
CMakeFiles/rocksdb.dir/options/options_helper.cc.o -c
/opt/local/var/macports/build/rocksdb-
d32946fd/work/rocksdb-10.1.3/options/options_helper.cc
:info:build [ 45%] Building CXX object
CMakeFiles/rocksdb.dir/options/options_parser.cc.o
:info:build /usr/bin/clang++ -DBZIP2 -DGFLAGS=1 -DGFLAGS_IS_A_DLL=0
-DHAVE_FULLFSYNC -DLZ4 -DOS_MACOSX -DROCKSDB_LIB_IO_POSIX
-DROCKSDB_NO_DYNAMIC_EXTENSION -DROCKSDB_PLATFORM_POSIX -DSNAPPY -DZLIB
-DZSTD -I/opt/local/var/macports/build/rocksdb-
d32946fd/work/rocksdb-10.1.3/include -I/opt/local/var/macports/build
/rocksdb-d32946fd/work/rocksdb-10.1.3 -isystem
/opt/local/var/macports/build/rocksdb-d32946fd/work/rocksdb-10.1.3/third-
party/gtest-1.8.1/fused-src -isystem /opt/local/include -pipe -Os -DNDEBUG
-I/opt/local/include -stdlib=libc++
-isysroot/Library/Developer/CommandLineTools/SDKs/MacOSX26.sdk -W -Wextra
-Wall -pthread -Wsign-compare -Wshadow -Wno-unused-parameter -Wno-unused-
variable -Woverloaded-virtual -Wnon-virtual-dtor -Wno-missing-field-
initializers -Wno-strict-aliasing -Wno-invalid-offsetof -fno-omit-frame-
pointer -momit-leaf-frame-pointer -march=armv8-a+crc+crypto -Wno-unused-
function -Werror -std=gnu++17 -arch arm64 -isysroot
/Library/Developer/CommandLineTools/SDKs/MacOSX26.sdk -mmacosx-version-
min=26.0 -MD -MT CMakeFiles/rocksdb.dir/options/options_parser.cc.o -MF
CMakeFiles/rocksdb.dir/options/options_parser.cc.o.d -o
CMakeFiles/rocksdb.dir/options/options_parser.cc.o -c
/opt/local/var/macports/build/rocksdb-
d32946fd/work/rocksdb-10.1.3/options/options_parser.cc
:info:build [ 45%] Building CXX object
CMakeFiles/rocksdb.dir/port/mmap.cc.o
:info:build /usr/bin/clang++ -DBZIP2 -DGFLAGS=1 -DGFLAGS_IS_A_DLL=0
-DHAVE_FULLFSYNC -DLZ4 -DOS_MACOSX -DROCKSDB_LIB_IO_POSIX
-DROCKSDB_NO_DYNAMIC_EXTENSION -DROCKSDB_PLATFORM_POSIX -DSNAPPY -DZLIB
-DZSTD -I/opt/local/var/macports/build/rocksdb-
d32946fd/work/rocksdb-10.1.3/include -I/opt/local/var/macports/build
/rocksdb-d32946fd/work/rocksdb-10.1.3 -isystem
/opt/local/var/macports/build/rocksdb-d32946fd/work/rocksdb-10.1.3/third-
party/gtest-1.8.1/fused-src -isystem /opt/local/include -pipe -Os -DNDEBUG
-I/opt/local/include -stdlib=libc++
-isysroot/Library/Developer/CommandLineTools/SDKs/MacOSX26.sdk -W -Wextra
-Wall -pthread -Wsign-compare -Wshadow -Wno-unused-parameter -Wno-unused-
variable -Woverloaded-virtual -Wnon-virtual-dtor -Wno-missing-field-
initializers -Wno-strict-aliasing -Wno-invalid-offsetof -fno-omit-frame-
pointer -momit-leaf-frame-pointer -march=armv8-a+crc+crypto -Wno-unused-
function -Werror -std=gnu++17 -arch arm64 -isysroot
/Library/Developer/CommandLineTools/SDKs/MacOSX26.sdk -mmacosx-version-
min=26.0 -MD -MT CMakeFiles/rocksdb.dir/port/mmap.cc.o -MF
CMakeFiles/rocksdb.dir/port/mmap.cc.o.d -o
CMakeFiles/rocksdb.dir/port/mmap.cc.o -c /opt/local/var/macports/build
/rocksdb-d32946fd/work/rocksdb-10.1.3/port/mmap.cc
:info:build [ 45%] Building CXX object
CMakeFiles/rocksdb.dir/port/stack_trace.cc.o
:info:build /usr/bin/clang++ -DBZIP2 -DGFLAGS=1 -DGFLAGS_IS_A_DLL=0
-DHAVE_FULLFSYNC -DLZ4 -DOS_MACOSX -DROCKSDB_LIB_IO_POSIX
-DROCKSDB_NO_DYNAMIC_EXTENSION -DROCKSDB_PLATFORM_POSIX -DSNAPPY -DZLIB
-DZSTD -I/opt/local/var/macports/build/rocksdb-
d32946fd/work/rocksdb-10.1.3/include -I/opt/local/var/macports/build
/rocksdb-d32946fd/work/rocksdb-10.1.3 -isystem
/opt/local/var/macports/build/rocksdb-d32946fd/work/rocksdb-10.1.3/third-
party/gtest-1.8.1/fused-src -isystem /opt/local/include -pipe -Os -DNDEBUG
-I/opt/local/include -stdlib=libc++
-isysroot/Library/Developer/CommandLineTools/SDKs/MacOSX26.sdk -W -Wextra
-Wall -pthread -Wsign-compare -Wshadow -Wno-unused-parameter -Wno-unused-
variable -Woverloaded-virtual -Wnon-virtual-dtor -Wno-missing-field-
initializers -Wno-strict-aliasing -Wno-invalid-offsetof -fno-omit-frame-
pointer -momit-leaf-frame-pointer -march=armv8-a+crc+crypto -Wno-unused-
function -Werror -std=gnu++17 -arch arm64 -isysroot
/Library/Developer/CommandLineTools/SDKs/MacOSX26.sdk -mmacosx-version-
min=26.0 -MD -MT CMakeFiles/rocksdb.dir/port/stack_trace.cc.o -MF
CMakeFiles/rocksdb.dir/port/stack_trace.cc.o.d -o
CMakeFiles/rocksdb.dir/port/stack_trace.cc.o -c
/opt/local/var/macports/build/rocksdb-
d32946fd/work/rocksdb-10.1.3/port/stack_trace.cc
:info:build /opt/local/var/macports/build/rocksdb-
d32946fd/work/rocksdb-10.1.3/port/mmap.cc:50:15: error: first argument in
call to 'memcpy' is a pointer to non-trivially copyable type
'rocksdb::MemMapping' [-Werror,-Wnontrivial-memcall]
:info:build 50 | std::memcpy(this, &other, sizeof(*this));
:info:build | ^
:info:build /opt/local/var/macports/build/rocksdb-
d32946fd/work/rocksdb-10.1.3/port/mmap.cc:50:15: note: explicitly cast the
pointer to silence this warning
:info:build 50 | std::memcpy(this, &other, sizeof(*this));
:info:build | ^
:info:build | (void*)
:info:build 1 error generated.
:info:build make[2]: *** [CMakeFiles/rocksdb.dir/port/mmap.cc.o] Error 1
:info:build make[2]: *** Waiting for unfinished jobs....
:info:build make[2]: Leaving directory `/opt/local/var/macports/build
/rocksdb-d32946fd/work/build'
:info:build make[1]: *** [CMakeFiles/rocksdb-shared.dir/all] Error 2
:info:build make[1]: *** Waiting for unfinished jobs....
:info:build make[2]: Leaving directory `/opt/local/var/macports/build
/rocksdb-d32946fd/work/build'
:info:build make[1]: *** [CMakeFiles/rocksdb.dir/all] Error 2
:info:build make[1]: Leaving directory `/opt/local/var/macports/build
/rocksdb-d32946fd/work/build'
:info:build make: *** [all] Error 2
:info:build make: Leaving directory `/opt/local/var/macports/build
/rocksdb-d32946fd/work/build'
:info:build Command failed: cd "/opt/local/var/macports/build/rocksdb-
d32946fd/work/build" && /usr/bin/make -j8 -w all VERBOSE=ON
:info:build Exit code: 2
:error:build Failed to build rocksdb: command execution failed
:debug:build Error code: CHILDSTATUS 56599 2
:debug:build Backtrace: command execution failed
:debug:build while executing
:debug:build "system {*}$notty {*}$callback {*}$nice $fullcmdstring"
:debug:build invoked from within
:debug:build "command_exec -callback
portprogress::target_progress_callback build"
:debug:build (procedure "portbuild::build_main" line 10)
:debug:build invoked from within
:debug:build "$procedure $targetname"
:error:build See
/opt/local/var/macports/logs/_opt_local_var_macports_sources_rsync.macports.org_macports_release_tarballs_ports_databases_rocksdb/rocksdb/main.log
for details.
}}}
--
Ticket URL: <https://trac.macports.org/ticket/74311>
MacPorts <https://www.macports.org/>
Ports system for macOS
More information about the macports-tickets
mailing list