[MacPorts] #74339: apr-util @1.6.5 does not build on PPC Leopard, Mac OS X 10.5.8, because of crypto/apr_passwd.c:73:20: error: missing binary operator before token "("
MacPorts
noreply at macports.org
Wed Aug 19 21:32:46 UTC 2026
#74339: apr-util @1.6.5 does not build on PPC Leopard, Mac OS X 10.5.8, because of
crypto/apr_passwd.c:73:20: error: missing binary operator before token "("
-------------------------+----------------------
Reporter: ballapete | Owner: (none)
Type: defect | Status: new
Priority: Normal | Milestone:
Component: ports | Version: 2.12.5
Keywords: ppc leopard | Port: apr-util
-------------------------+----------------------
{{{
/bin/sh /opt/local/share/apr-1/build/libtool --silent --mode=compile
--tag=CC /usr/bin/gcc-4.2 -std=gnu99 -arch ppc -pipe -Os -DHAVE_CONFIG_H
-DDARWIN -DSIGPROCMASK_SETS_THREAD_MASK -I/opt/local/include
-I/opt/local/var/macports/build/apr-util-ac417e7a/work/apr-
util-1.6.5/include -I/opt/local/var/macports/build/apr-util-ac417e7a/work
/apr-util-1.6.5/include/private -I/opt/local/include
-I/opt/local/include/apr-1 -I/opt/local/include -o crypto/apr_passwd.lo
-c crypto/apr_passwd.c && touch crypto/apr_passwd.lo
crypto/apr_passwd.c:73:20: error: missing binary operator before token "("
make[1]: *** [crypto/apr_passwd.lo] Error 1
make[1]: Leaving directory `/opt/local/var/macports/build/apr-util-
ac417e7a/work/apr-util-1.6.5'
make: *** [all-recursive] Error 1
make: Leaving directory `/opt/local/var/macports/build/apr-util-
ac417e7a/work/apr-util-1.6.5'
Command failed: cd "/opt/local/var/macports/build/apr-util-ac417e7a/work
/apr-util-1.6.5" && /usr/bin/make -w all EXTRA_CFLAGS='-arch ppc'
EXTRA_LDFLAGS='-arch ppc'
Exit code: 2
}}}
Main.log file does not exist – some malfunction of port?
--
Ticket URL: <https://trac.macports.org/ticket/74339>
MacPorts <https://www.macports.org/>
Ports system for macOS
More information about the macports-tickets
mailing list