[MacPorts] #74349: Testing python314 @3.14.7 on intel Sonoma 14.8.9 fails, some python interpreter crashes three times

MacPorts noreply at macports.org
Sun Aug 23 09:09:51 UTC 2026


#74349: Testing python314 @3.14.7 on intel Sonoma 14.8.9 fails, some python
interpreter crashes three times
--------------------------+-----------------------
 Reporter:  ballapete     |      Owner:  (none)
     Type:  defect        |     Status:  new
 Priority:  Normal        |  Milestone:
Component:  ports         |    Version:  2.12.5
 Keywords:  sonoma intel  |       Port:  python314
--------------------------+-----------------------
 {{{
 ----------------------------------------------------------------------
 Ran 196 tests in 37.163s

 OK (skipped=16)
 8 tests failed again:
     test.test_asyncio.test_subprocess test_os test_popen test_pyrepl
     test_readline test_subprocess test_venv test_zipfile

 == Tests result: FAILURE then FAILURE ==

 10 slowest tests:
 - test.test_concurrent_futures.test_process_pool: 1 min 53 sec
 - test.test_multiprocessing_spawn.test_processes: 1 min 46 sec
 - test.test_multiprocessing_forkserver.test_misc: 1 min 25 sec
 - test.test_multiprocessing_spawn.test_misc: 1 min 22 sec
 - test.test_multiprocessing_forkserver.test_processes: 1 min 20 sec
 - test.test_multiprocessing_spawn.test_manager: 54.5 sec
 - test.test_concurrent_futures.test_shutdown: 49.3 sec
 - test.test_concurrent_futures.test_deadlock: 46.1 sec
 - test_regrtest: 45.2 sec
 - test_ssl: 43.7 sec

 33 tests skipped:
     test.test_asyncio.test_windows_events
     test.test_asyncio.test_windows_utils test.test_gdb.test_backtrace
     test.test_gdb.test_cfunction test.test_gdb.test_cfunction_full
     test.test_gdb.test_misc test.test_gdb.test_pretty_print
     test.test_multiprocessing_fork.test_manager
     test.test_multiprocessing_fork.test_misc
     test.test_multiprocessing_fork.test_processes
     test.test_multiprocessing_fork.test_threads test_android
     test_dbm_gnu test_devpoll test_dtrace test_epoll
     test_free_threading test_idle test_launcher test_msvcrt
     test_perf_profiler test_perfmaps test_startfile test_tcl
     test_tkinter test_ttk test_ttk_textonly test_turtle test_winapi
     test_winconsoleio test_winreg test_winsound test_wmi

 3 tests skipped (resource denied):
     test_peg_generator test_xpickle test_zipfile64

 9 re-run tests:
     test.test_asyncio.test_subprocess test_os test_popen test_pyrepl
     test_readline test_ssl test_subprocess test_venv test_zipfile

 8 tests failed:
     test.test_asyncio.test_subprocess test_os test_popen test_pyrepl
     test_readline test_subprocess test_venv test_zipfile

 448 tests OK.

 Total duration: 3 min 56 sec
 Total tests: run=47,919 failures=226 skipped=2,292
 Total test files: run=498/492 failed=8 skipped=33 resource_denied=3
 rerun=9
 Result: FAILURE then FAILURE
 make: *** [test] Error 2
 Command failed:  cd
 "/opt/local/var/macports/build/python314-45e956ad/work/Python-3.14.7" &&
 /usr/bin/make test
 Exit code: 2
 }}}

 Details in main.log.

-- 
Ticket URL: <https://trac.macports.org/ticket/74349>
MacPorts <https://www.macports.org/>
Ports system for macOS


More information about the macports-tickets mailing list