[MacPorts] #74356: util-linux @2.42.2 does not build on PPC Leopard, Mac OS X 10.5.8, because of ./include/c.h:180:18: error: missing binary operator before token "("

MacPorts noreply at macports.org
Mon Aug 24 07:41:22 UTC 2026


#74356: util-linux @2.42.2 does not build on PPC Leopard, Mac OS X 10.5.8, because
of ./include/c.h:180:18: error: missing binary operator before token "("
-------------------------+------------------------
 Reporter:  ballapete    |      Owner:  (none)
     Type:  defect       |     Status:  new
 Priority:  Normal       |  Milestone:
Component:  ports        |    Version:  2.12.5
 Keywords:  ppc leopard  |       Port:  util-linux
-------------------------+------------------------
 {{{
 --->  Building util-linux
 Executing:  cd "/opt/local/var/macports/build/util-linux-dfe00ca0/work
 /util-linux-2.42.2" && /usr/bin/make -w colcrt column getopt hardlink look
 rename rev scriptreplay setsid
 make: Entering directory `/opt/local/var/macports/build/util-linux-
 dfe00ca0/work/util-linux-2.42.2'
 depbase=`echo text-utils/colcrt.o | sed 's|[^/]*$|.deps/&|;s|\.o$||'`;\
         /usr/bin/gcc-4.2 -std=gnu99 -DHAVE_CONFIG_H -I.  -include config.h
 -I./include -DLOCALEDIR=\"/opt/local/share/locale\"
 -D_PATH_RUNSTATEDIR=\"/opt/local/var/run\"
 -D_PATH_LOCALSTATEDIR=\"/opt/local/var\"
 -D_PATH_SYSCONFDIR=\"/opt/local/etc\"
 -D_PATH_SYSCONFSTATICDIR=\"/opt/local/lib\"    -I/opt/local/include
 -I/opt/local/include/LegacySupport -fsigned-char -fno-common -Wall -Wextra
 -Wimplicit-function-declaration -Wmissing-declarations -Wmissing-
 prototypes -Wnested-externs -Wno-missing-field-initializers -Wold-style-
 definition -Wpointer-arith -Wredundant-decls -Wsign-compare -Wstrict-
 prototypes -Wunused-parameter -Wunused-variable -Werror=sequence-point
 -pipe -Os -I/opt/local/include/LegacySupport -arch ppc -MT text-
 utils/colcrt.o -MD -MP -MF $depbase.Tpo -c -o text-utils/colcrt.o text-
 utils/colcrt.c &&\
         mv -f $depbase.Tpo $depbase.Po
 In file included from text-utils/colcrt.c:50:
 ./include/c.h:180:18: error: missing binary operator before token "("
 make: *** [text-utils/colcrt.o] Error 1
 make: Leaving directory `/opt/local/var/macports/build/util-linux-
 dfe00ca0/work/util-linux-2.42.2'
 Command failed:  cd "/opt/local/var/macports/build/util-linux-
 dfe00ca0/work/util-linux-2.42.2" && /usr/bin/make -w colcrt column getopt
 hardlink look rename rev scriptreplay setsid
 Exit code: 2
 }}}

-- 
Ticket URL: <https://trac.macports.org/ticket/74356>
MacPorts <https://www.macports.org/>
Ports system for macOS


More information about the macports-tickets mailing list