[MacPorts] #74196: Error: Failed to build OpenCoarrays: command execution failed
MacPorts
noreply at macports.org
Wed Jul 8 13:27:20 UTC 2026
#74196: Error: Failed to build OpenCoarrays: command execution failed
--------------------+--------------------------
Reporter: ffm-fg | Owner: (none)
Type: defect | Status: new
Priority: Normal | Milestone:
Component: ports | Version:
Keywords: | Port: OpenCoarrays
--------------------+--------------------------
The installation of opencoarrays fails.
These are the last lines of the log file:
.
.
.
.
:info:build __caf_init.210.1 in ccnOJu4z.o
:info:build __caf_init.210.1 in ccnOJu4z.o
:info:build __caf_init.210.1 in ccnOJu4z.o
:info:build __caf_init.210.1 in ccnOJu4z.o
:info:build __caf_init.210.1 in ccnOJu4z.o
:info:build __caf_init.210.1 in ccnOJu4z.o
:info:build ...
:info:build "__gfortran_caf_register_accessors_finish", referenced from:
:info:build __caf_init.210.1 in ccnOJu4z.o
:info:build ld: symbol(s) not found for architecture arm64
:info:build collect2: error: ld returned 1 exit status
:info:build Error: command:
:info:build `/opt/local/bin/mpif90-mpich-gcc15
-I/opt/local/var/macports/build/OpenCoarrays-
b999f285/work/build/include/OpenCoarrays-2.10.2_GNU-15.2.0 -fcoarray=lib
-lpthread -DPREFIX_NAME=_gfortran_caf_ -DGCC_GE_7 -DGCC_GE_8 -DHAVE_MPI
-DMPI_WORKING_MODULE -o /opt/local/var/macports/build/OpenCoarrays-
b999f285/work/build/bin/OpenCoarrays-2.10.2-tests/alloc_comp_multidim_shape
/opt/local/var/macports/build/OpenCoarrays-
b999f285/work/OpenCoarrays-2.10.2/src/tests/unit/send-
get/alloc_comp_multidim_shape.F90 /opt/local/var/macports/build
/OpenCoarrays-b999f285/work/build/lib/libopencoarrays_test_utilities.a
/opt/local/var/macports/build/OpenCoarrays-
b999f285/work/build/lib/libopencoarrays_mod.a
/opt/local/var/macports/build/OpenCoarrays-
b999f285/work/build/lib/libcaf_mpi.a`
:info:build failed to compile.
:info:build make[2]: *** [src/tests/unit/send-
get/alloc_comp_multidim_shape] Error 1
:info:build make[2]: Leaving directory `/opt/local/var/macports/build
/OpenCoarrays-b999f285/work/build'
:info:build make[1]: *** [src/tests/unit/send-
get/CMakeFiles/build_alloc_comp_multidim_shape.dir/all] Error 2
:info:build make[1]: Leaving directory `/opt/local/var/macports/build
/OpenCoarrays-b999f285/work/build'
:info:build make: *** [all] Error 2
:info:build make: Leaving directory `/opt/local/var/macports/build
/OpenCoarrays-b999f285/work/build'
:info:build Command failed: cd "/opt/local/var/macports/build
/OpenCoarrays-b999f285/work/build" && /usr/bin/make -j18 -w all VERBOSE=ON
:info:build Exit code: 2
:error:build Failed to build OpenCoarrays: command execution failed
:debug:build Error code: CHILDSTATUS 24968 2
:debug:build Backtrace: command execution failed
:debug:build while executing
:debug:build "system {*}$notty {*}$callback {*}$nice $fullcmdstring"
:debug:build invoked from within
:debug:build "command_exec -callback
portprogress::target_progress_callback build"
:debug:build (procedure "portbuild::build_main" line 10)
:debug:build invoked from within
:debug:build "$procedure $targetname"
:error:build See
/opt/local/var/macports/logs/_opt_local_var_macports_sources_rsync.macports.org_macports_release_tarballs_ports_science_OpenCoarrays/OpenCoarrays/main.log
for details.
--
Ticket URL: <https://trac.macports.org/ticket/74196>
MacPorts <https://www.macports.org/>
Ports system for macOS
More information about the macports-tickets
mailing list