Re: [MacPorts] #74221: scamper fails to build after update to 20260713: sc_rxifd.c: error: ‘quic4’ undeclared (first use in this function)

MacPorts noreply at macports.org
Wed Jul 15 09:41:40 UTC 2026


#74221: scamper fails to build after update to 20260713: sc_rxifd.c: error: ‘quic4’
undeclared (first use in this function)
---------------------------+--------------------
  Reporter:  barracuda156  |      Owner:  (none)
      Type:  defect        |     Status:  new
  Priority:  Normal        |  Milestone:
 Component:  ports         |    Version:  2.12.5
Resolution:                |   Keywords:
      Port:  scamper       |
---------------------------+--------------------

Comment (by barracuda156):

 Somehow upstream managed to break it even with QUIC disabled:
 {{{
 :info:build Making all in sc_rxifd
 :info:build make[3]: Entering directory `/opt/local/var/macports/build
 /scamper-b7ad0ed7/work/scamper-cvs-20260713/utils/sc_rxifd'
 :info:build depbase=`echo sc_rxifd.o | sed 's|[^/]*$|.deps/&|;s|\.o$||'`;\
 :info:build     /usr/bin/gcc-4.2 -std=gnu99 -DHAVE_CONFIG_H -I. -I../..
 -I../.. -I/opt/local/libexec/openssl3/include -isystem/opt/local/include
 -pipe -I/opt/local/libexec/openssl3/include -Os -arch ppc  -MT sc_rxifd.o
 -MD -MP -MF $depbase.Tpo -c -o sc_rxifd.o sc_rxifd.c &&\
 :info:build     mv -f $depbase.Tpo $depbase.Po
 :info:build depbase=`echo ../../mjl_huffman.o | sed
 's|[^/]*$|.deps/&|;s|\.o$||'`;\
 :info:build     /usr/bin/gcc-4.2 -std=gnu99 -DHAVE_CONFIG_H -I. -I../..
 -I../.. -I/opt/local/libexec/openssl3/include -isystem/opt/local/include
 -pipe -I/opt/local/libexec/openssl3/include -Os -arch ppc  -MT
 ../../mjl_huffman.o -MD -MP -MF $depbase.Tpo -c -o ../../mjl_huffman.o
 ../../mjl_huffman.c &&\
 :info:build     mv -f $depbase.Tpo $depbase.Po
 :info:build sc_rxifd.c: In function ‘rxifd’:
 :info:build sc_rxifd.c:2551: warning: ‘daemon’ is deprecated (declared at
 /usr/include/stdlib.h:289)
 :info:build sc_rxifd.c:2586: error: ‘OPT_IPV4’ undeclared (first use in
 this function)
 :info:build sc_rxifd.c:2586: error: (Each undeclared identifier is
 reported only once
 :info:build sc_rxifd.c:2586: error: for each function it appears in.)
 :info:build make[3]: *** [sc_rxifd.o] Error 1
 :info:build make[3]: Leaving directory `/opt/local/var/macports/build
 /scamper-b7ad0ed7/work/scamper-cvs-20260713/utils/sc_rxifd'
 :info:build make[2]: *** [all-recursive] Error 1
 :info:build make[2]: Leaving directory `/opt/local/var/macports/build
 /scamper-b7ad0ed7/work/scamper-cvs-20260713/utils'
 :info:build make[1]: *** [all-recursive] Error 1
 :info:build make[1]: Leaving directory `/opt/local/var/macports/build
 /scamper-b7ad0ed7/work/scamper-cvs-20260713'
 :info:build make: *** [all] Error 2
 }}}

-- 
Ticket URL: <https://trac.macports.org/ticket/74221#comment:1>
MacPorts <https://www.macports.org/>
Ports system for macOS


More information about the macports-tickets mailing list