[MacPorts] #74249: coreutils @ 9.11_0: fails to build on Mac OS X 10.5 Leopard
MacPorts
noreply at macports.org
Sat Jul 25 11:10:48 UTC 2026
#74249: coreutils @ 9.11_0: fails to build on Mac OS X 10.5 Leopard
-----------------------+-----------------------
Reporter: IOOI-SqAR | Owner: (none)
Type: defect | Status: new
Priority: Normal | Milestone:
Component: ports | Version: 2.12.5
Keywords: | Port: coreutils
-----------------------+-----------------------
It fails like this:
{{{:info:build /usr/bin/gcc-4.2 -std=gnu99 -pipe -Os -arch ppc
-L/opt/local/lib -Wl,-headerpad_max_install_names -arch ppc -o src/cut
src/cut.o src/set-fields.o src/libver.a lib/libcoreutils.a -lintl
-Wl,-framework -Wl,CoreFoundation -Wl,-framework -Wl,CoreServices
lib/libcoreutils.a
:info:build Undefined symbols:
:info:build "_memmem", referenced from:
:info:build _cut_fields_bytesearch in cut.o
:info:build _cut_fields_bytesearch in cut.o
:info:build ld: symbol(s) not found
:info:build collect2: ld returned 1 exit status
:info:build make[2]: *** [src/cut] Error 1
:info:build make[2]: Leaving directory `/opt/local/var/macports/build
/coreutils-979a8e99/work/coreutils-9.11'
:info:build make[1]: *** [all-recursive] Error 1
:info:build make[1]: Leaving directory `/opt/local/var/macports/build
/coreutils-979a8e99/work/coreutils-9.11'
:info:build make: *** [all] Error 2
:info:build make: Leaving directory `/opt/local/var/macports/build
/coreutils-979a8e99/work/coreutils-9.11'
:info:build Command failed: cd "/opt/local/var/macports/build/coreutils-
979a8e99/work/coreutils-9.11" && /usr/bin/make -w all
:info:build Exit code: 2
:error:build Failed to build coreutils: command execution failed
:debug:build Error code: CHILDSTATUS 36630 2
:debug:build Backtrace: command execution failed
:debug:build while executing
:debug:build "system {*}$notty {*}$callback {*}$nice $fullcmdstring"
:debug:build invoked from within
:debug:build "command_exec -callback
portprogress::target_progress_callback build"
:debug:build (procedure "portbuild::build_main" line 10)
:debug:build invoked from within
:debug:build "$procedure $targetname"
:error:build See
/opt/local/var/macports/logs/_opt_local_var_macports_sources_rsync.macports.org_macports_release_tarballs_ports_sysutils_coreutils/coreutils/main.log
for details.
}}}
--
Ticket URL: <https://trac.macports.org/ticket/74249>
MacPorts <https://www.macports.org/>
Ports system for macOS
More information about the macports-tickets
mailing list