June 2026 Archives by author
Starting: Mon Jun 1 00:00:07 UTC 2026
Ending: Tue Jun 30 20:01:41 UTC 2026
Messages: 716
- [MacPorts] #74057: emacs-app fails to find gcc driver
MacPorts
- [MacPorts] #65160: fastly downloads throttled
MacPorts
- [MacPorts] #74055: qt5-qtconnectivity-docs @5.15.19: patch fails
MacPorts
- [MacPorts] #65545: py39-pyobjc: broken on macOS 10.13
MacPorts
- [MacPorts] #65359: emacs needs -nativecomp on M1 Mac
MacPorts
- [MacPorts] #74043: texlive-bin @2025.74524_1 does not rebuild on PPC Leopard, Mac OS X 10.5.8, because TeX Live sources redefine getopt() and getenv() and in pTeX a variable is named "bool"!
MacPorts
- [MacPorts] #65110: texlive-lang-italian was stealth-updated
MacPorts
- [MacPorts] #71825: emacs installs unwanted tree-sitters by default
MacPorts
- [MacPorts] #72136: emacs @30.1_1 imagemagick+nativecomp+rsvg+treesitter: etags-program-name has wrong value
MacPorts
- [MacPorts] #72247: emacs-devel, emacs-app-devel: TRAMP failure with `tramp-use-connection-share' set
MacPorts
- [MacPorts] #74062: Unable to install xalanc in MacOS Tahoe 26.5
MacPorts
- [MacPorts] #71047: emacs-app @29.4_1+imagemagick+nativecomp+rsvg+treesitter: Failed to activate
MacPorts
- [MacPorts] #67987: emacs @29.1_1 on Mac OS X ventura 13.4.1 cannot install magit
MacPorts
- [MacPorts] #74063: Unable to install xalanc in Mac OS Tahoe 26.5
MacPorts
- [MacPorts] #74063: Unable to install xalanc in Mac OS Tahoe 26.5
MacPorts
- [MacPorts] #65889: emacs @28.2 configuration error: libgccjit failed to compile and run a test program
MacPorts
- [MacPorts] #64976: emacs @28.1: incomprehensible warnings during running
MacPorts
- [MacPorts] #64134: emacs-devel @20211112 does not become operable on macOS Monterey, version 12.0.1
MacPorts
- [MacPorts] #60992: emacs-app-devel @20200811_0: missing image-converter.el[.gz | c]
MacPorts
- [MacPorts] #69001: polyml @5.9_1: ld: LINKEDIT overlap of start of LINKEDIT and symbol table
MacPorts
- [MacPorts] #65160: fastly downloads throttled
MacPorts
- [MacPorts] #73306: emacs @30.2: GLib-GIO-CRITICAL **: 09:08:13.820: g_settings_schema_source_lookup: assertion 'source != NULL' failed
MacPorts
- [MacPorts] #61163: emacs @27.1_1 +x11: GLib-GIO-CRITICAL error/warning when running
MacPorts
- [MacPorts] #73569: codex @0.105.0: killed after 1 hour of no build output
MacPorts
- [MacPorts] #73696: poppler @26.02.0_0: Undefined symbols __ZN5GpgME4Data8toStringB5cxx11Ev __ZNK5GpgME5Error11asStdStringB5cxx11Ev
MacPorts
- [MacPorts] #73696: poppler @26.02.0_0: Undefined symbols __ZN5GpgME4Data8toStringB5cxx11Ev __ZNK5GpgME5Error11asStdStringB5cxx11Ev
MacPorts
- [MacPorts] #73696: poppler @26.02.0_0: Undefined symbols __ZN5GpgME4Data8toStringB5cxx11Ev __ZNK5GpgME5Error11asStdStringB5cxx11Ev
MacPorts
- [MacPorts] #73696: poppler @26.02.0_0: Undefined symbols __ZN5GpgME4Data8toStringB5cxx11Ev __ZNK5GpgME5Error11asStdStringB5cxx11Ev
MacPorts
- [MacPorts] #74064: (10.14) failed to upgradge > rust
MacPorts
- [MacPorts] #74064: (10.14) failed to upgradge > rust
MacPorts
- [MacPorts] #73696: poppler @26.02.0_0: Undefined symbols __ZN5GpgME4Data8toStringB5cxx11Ev __ZNK5GpgME5Error11asStdStringB5cxx11Ev
MacPorts
- [MacPorts] #72136: emacs @30.1_1 imagemagick+nativecomp+rsvg+treesitter: etags-program-name has wrong value
MacPorts
- [MacPorts] #74063: Unable to install xalanc in Mac OS Tahoe 26.5
MacPorts
- [MacPorts] #74062: xalanc: configure error on macOS 26 (was: Unable to install xalanc in MacOS Tahoe 26.5)
MacPorts
- [MacPorts] #74057: emacs-app fails to find gcc driver
MacPorts
- [MacPorts] #74065: (mpv +vapoursynth) fail to build on Big Sur
MacPorts
- [MacPorts] #74065: (mpv +vapoursynth) fail to build on Big Sur
MacPorts
- [MacPorts] #74033: Poppler -- Unable to Configure -- unrecognized argument in option '-stdlib=macports-libstdc++'
MacPorts
- [MacPorts] #72469: wxmaxima does not open a file dialog so it can't save files
MacPorts
- [MacPorts] #73764: rust build fails with "Checksum (sha256) mismatch for unicode-properties-0.1.4.crate"
MacPorts
- [MacPorts] #74056: deno-2.8.1 not available on macports mirrors for updating
MacPorts
- [MacPorts] #74061: Ridiculously slow download speed from MacPorts packages repository
MacPorts
- [MacPorts] #74065: mpv @0.37.0 +vapoursynth: fatal error: 'VSScript.h' file not found (was: (mpv +vapoursynth) fail to build on Big Sur)
MacPorts
- [MacPorts] #74056: deno-2.8.1 not available on macports mirrors for updating
MacPorts
- [MacPorts] #74062: xalanc: configure error on macOS 26
MacPorts
- [MacPorts] #73995: deno @2.7.14: dyld: lazy symbol binding failed: Symbol not found: _aligned_alloc (was: deno: improve compatibility)
MacPorts
- [MacPorts] #74066: Provide a better message when a port doesn't support this OS version
MacPorts
- [MacPorts] #74011: texlive-bin-2026.7823 after build fails staging on Tahoe x86 + workaround
MacPorts
- [MacPorts] #74011: texlive-bin-2026.7823 after build fails staging on Tahoe x86 + workaround
MacPorts
- [MacPorts] #74067: fftw-3 dependency on "openmpi-clang22" not found
MacPorts
- [MacPorts] #74067: fftw-3 dependency on "openmpi-clang22" not found
MacPorts
- [MacPorts] #71069: texlive-bibtex-extra: biber-ms executable missing
MacPorts
- [MacPorts] #71069: texlive-bibtex-extra: biber-ms executable missing
MacPorts
- [MacPorts] #65160: fastly downloads throttled
MacPorts
- [MacPorts] #65160: fastly downloads throttled
MacPorts
- [MacPorts] #71069: texlive-bibtex-extra: biber-ms executable missing
MacPorts
- [MacPorts] #74033: Poppler -- Unable to Configure -- unrecognized argument in option '-stdlib=macports-libstdc++'
MacPorts
- [MacPorts] #73966: gnutls @3.8.13: compiling from source code freezes on macOS 10.8
MacPorts
- [MacPorts] #74063: Unable to install xalanc in Mac OS Tahoe 26.5
MacPorts
- [MacPorts] #74062: xalanc: configure error on macOS 26
MacPorts
- [MacPorts] #74063: xalanc @1.12_1 fails to build with cmake-devel (was: Unable to install xalanc in Mac OS Tahoe 26.5)
MacPorts
- [MacPorts] #74067: fftw-3 dependency on "openmpi-clang22" not found
MacPorts
- [MacPorts] #74064: (10.14) failed to upgradge > rust
MacPorts
- [MacPorts] #74065: mpv @0.37.0 +vapoursynth: fatal error: 'VSScript.h' file not found
MacPorts
- [MacPorts] #74066: Provide a better message when a port doesn't support this OS version
MacPorts
- [MacPorts] #74040: arm64 build machine is offline
MacPorts
- [MacPorts] #74053: Update neomutt
MacPorts
- [MacPorts] #73696: poppler @26.02.0_0: Undefined symbols __ZN5GpgME4Data8toStringB5cxx11Ev __ZNK5GpgME5Error11asStdStringB5cxx11Ev
MacPorts
- [MacPorts] #73696: poppler @26.02.0_0: Undefined symbols __ZN5GpgME4Data8toStringB5cxx11Ev __ZNK5GpgME5Error11asStdStringB5cxx11Ev
MacPorts
- [MacPorts] #73966: gnutls @3.8.13: compiling from source code freezes on macOS 10.8
MacPorts
- [MacPorts] #73696: poppler @26.02.0_0: Undefined symbols __ZN5GpgME4Data8toStringB5cxx11Ev __ZNK5GpgME5Error11asStdStringB5cxx11Ev
MacPorts
- [MacPorts] #72469: wxmaxima does not open a file dialog so it can't save files
MacPorts
- [MacPorts] #65160: fastly downloads throttled
MacPorts
- [MacPorts] #74068: gradle fallback pulls source-built openjdk17 during ghidra install even though ghidra will install openjdk25-zulu
MacPorts
- [MacPorts] #73696: poppler @26.02.0_0: Undefined symbols __ZN5GpgME4Data8toStringB5cxx11Ev __ZNK5GpgME5Error11asStdStringB5cxx11Ev
MacPorts
- [MacPorts] #72136: emacs @30.1_1 imagemagick+nativecomp+rsvg+treesitter: etags-program-name has wrong value
MacPorts
- [MacPorts] #72136: emacs @30.1_1 imagemagick+nativecomp+rsvg+treesitter: etags-program-name has wrong value
MacPorts
- [MacPorts] #72136: emacs @30.1_1 imagemagick+nativecomp+rsvg+treesitter: etags-program-name has wrong value
MacPorts
- [MacPorts] #74069: podofo @1.1.0 does not build on intel macOS High Sierra, Version 10.13.6, because of error: 'to_chars' is unavailable: introduced in macOS 13.3
MacPorts
- [MacPorts] #74069: podofo @1.1.0 does not build on intel macOS High Sierra, Version 10.13.6, because of error: 'to_chars' is unavailable: introduced in macOS 13.3
MacPorts
- [MacPorts] #73696: poppler @26.02.0_0: Undefined symbols __ZN5GpgME4Data8toStringB5cxx11Ev __ZNK5GpgME5Error11asStdStringB5cxx11Ev
MacPorts
- [MacPorts] #73696: poppler @26.02.0_0: Undefined symbols __ZN5GpgME4Data8toStringB5cxx11Ev __ZNK5GpgME5Error11asStdStringB5cxx11Ev
MacPorts
- [MacPorts] #73530: qgis3 Add QtDesigner
MacPorts
- [MacPorts] #74011: texlive-bin-2026.7823 after build fails staging on Tahoe x86 + workaround
MacPorts
- [MacPorts] #74070: opencv4 @4.9.0_9: build failure when ffmpeg is active
MacPorts
- [MacPorts] #74056: deno-2.8.1 not available on macports mirrors for updating
MacPorts
- [MacPorts] #74071: fastfetch at 2.64.0 fails upgrade: error: conflicting types for 'lua_rawlen'
MacPorts
- [MacPorts] #74071: fastfetch at 2.64.0 fails upgrade: error: conflicting types for 'lua_rawlen'
MacPorts
- [MacPorts] #74002: icu @78.3_1: fails to upgrade on x86_64 Tahoe with: configure: error: Python failed to run: ValueError: source code string cannot contain null bytes
MacPorts
- [MacPorts] #74072: Chmox @0.4_6: CVS password: cvs [login aborted]: connect to chmox.cvs.sourceforge.net(216.105.38.20):2401 failed: Connection refused
MacPorts
- [MacPorts] #74072: Chmox @0.4_6: CVS password: cvs [login aborted]: connect to chmox.cvs.sourceforge.net(216.105.38.20):2401 failed: Connection refused
MacPorts
- [MacPorts] #65160: fastly downloads throttled
MacPorts
- [MacPorts] #74014: ollama @0.24.0_0+completion+mlx cannot load mlx models
MacPorts
- [MacPorts] #73696: poppler @26.02.0_0: Undefined symbols __ZN5GpgME4Data8toStringB5cxx11Ev __ZNK5GpgME5Error11asStdStringB5cxx11Ev
MacPorts
- [MacPorts] #62237: texlive +basic +letter "sh: texconfig-sys: command not found"
MacPorts
- [MacPorts] #73590: texlive tlmgr paper letter
MacPorts
- [MacPorts] #73590: texlive tlmgr paper letter
MacPorts
- [MacPorts] #62237: texlive +basic +letter "sh: texconfig-sys: command not found"
MacPorts
- [MacPorts] #64020: texlive-basic: TeX ignores openout_any configuration option
MacPorts
- [MacPorts] #63226: biblatex-biber: loadable library and perl binaries are mismatched
MacPorts
- [MacPorts] #69265: texlive-bin @2023.66589 build failure: fatal error: 'mplibps.h' file not found
MacPorts
- [MacPorts] #71773: texlive-bin fails to build with gcc14: error: assignment to 'boolean *' {aka 'int *'} from incompatible pointer type 'internalfontnumber *' {aka 'long int *'}
MacPorts
- [MacPorts] #69297: luametatex @2.10.08 does not build on PPC Tiger, Mac OS X 10.4.11, because of "cc1: error: unrecognized command line option "-Wno-unused-result""
MacPorts
- [MacPorts] #73696: poppler @26.02.0_0: Undefined symbols __ZN5GpgME4Data8toStringB5cxx11Ev __ZNK5GpgME5Error11asStdStringB5cxx11Ev
MacPorts
- [MacPorts] #73696: poppler @26.02.0_0: Undefined symbols __ZN5GpgME4Data8toStringB5cxx11Ev __ZNK5GpgME5Error11asStdStringB5cxx11Ev
MacPorts
- [MacPorts] #60979: texlive-bin @2020.54632_2+x11 build failure with gmp or mpfr in /usr/local
MacPorts
- [MacPorts] #73696: poppler @26.02.0_0: Undefined symbols __ZN5GpgME4Data8toStringB5cxx11Ev __ZNK5GpgME5Error11asStdStringB5cxx11Ev
MacPorts
- [MacPorts] #60869: texlive-bin: building under --with-no-root-privileges fails attepting to create dir /Library/TeX
MacPorts
- [MacPorts] #62376: texlive-bin tries to install stuff in system space even when macports is confihgured to put everything in home dir. [universal, Big Sur]
MacPorts
- [MacPorts] #59680: hyperref links are coming out as solid blocks of color
MacPorts
- [MacPorts] #74002: icu @78.3_1: fails to upgrade on x86_64 Tahoe with: configure: error: Python failed to run: ValueError: source code string cannot contain null bytes
MacPorts
- [MacPorts] #66250: libunwind: Causes other ports to fail to build
MacPorts
- [MacPorts] #74073: How to uninstall 'yt-dlp' from MacPorts
MacPorts
- [MacPorts] #74070: opencv4 @4.9.0_9: build failure when ffmpeg is active
MacPorts
- [MacPorts] #74074: netcdf @4.10.0 missing CDF5 support on arm64 builds
MacPorts
- [MacPorts] #74075: /opt/local/bin/claude wrapper script badly passes through arguments
MacPorts
- [MacPorts] #74076: iaito @6.1.6_0: error: 'loc' in capture list does not name a variable on macOS 13
MacPorts
- [MacPorts] #74077: mlx-c 0.6.0_1 fails with CMake Error at /opt/local/share/cmake/MLX/MLXConfig.cmake:49
MacPorts
- [MacPorts] #74078: libheif fails to build on high sierra
MacPorts
- [MacPorts] #74078: libheif fails to build on high sierra
MacPorts
- [MacPorts] #74078: libheif fails to build on high sierra
MacPorts
- [MacPorts] #74075: /opt/local/bin/claude wrapper script badly passes through arguments
MacPorts
- [MacPorts] #73569: codex @0.105.0: killed after 1 hour of no build output
MacPorts
- [MacPorts] #74078: libheif fails to build on high sierra
MacPorts
- [MacPorts] #74078: libheif fails to build on high sierra
MacPorts
- [MacPorts] #74078: libheif fails to build on high sierra
MacPorts
- [MacPorts] #72685: Erlang/OTP 28 breaks Elixir 1.18
MacPorts
- [MacPorts] #73754: pandoc @3.9.0.2_0: fails to build if gcc is installed
MacPorts
- [MacPorts] #74034: pandoc @3.9.0.2_1: fails to build if gcc is installed
MacPorts
- [MacPorts] #74013: mas: mas port lacks man page and wrapper shell script
MacPorts
- [MacPorts] #69944: zstd @1.5.6: does not respect macos setting on build
MacPorts
- [MacPorts] #69944: zstd @1.5.6: does not respect macos setting on build
MacPorts
- [MacPorts] #68991: exiv2: Update to 0.28.1
MacPorts
- [MacPorts] #72344: svt-av1 @3.0.2 - failed to build
MacPorts
- [MacPorts] #65160: fastly downloads throttled
MacPorts
- [MacPorts] #74078: libheif fails to build on high sierra
MacPorts
- [MacPorts] #74078: libheif fails to build on high sierra
MacPorts
- [MacPorts] #74079: Error: Failed to build opencv4-devel: command execution failed
MacPorts
- [MacPorts] #74079: Error: Failed to build opencv4-devel: command execution failed
MacPorts
- [MacPorts] #74080: pandoc at 3.9.0.2 upgrade (build from source) fails; Tahoe 26.5.1 arm64
MacPorts
- [MacPorts] #74080: pandoc at 3.9.0.2 upgrade (build from source) fails; Tahoe 26.5.1 arm64
MacPorts
- [MacPorts] #74075: /opt/local/bin/claude wrapper script badly passes through arguments
MacPorts
- [MacPorts] #74080: pandoc at 3.9.0.2 upgrade (build from source) fails; Tahoe 26.5.1 arm64
MacPorts
- [MacPorts] #74027: qt6-qtbase @6.11.1_1: fatal error: headers not found
MacPorts
- [MacPorts] #74078: libheif fails to build on high sierra
MacPorts
- [MacPorts] #74078: libheif fails to build on high sierra
MacPorts
- [MacPorts] #73305: qt6-qtbase @6.10.1: breaking changes in the QtPrivate functions API
MacPorts
- [MacPorts] #74027: qt6-qtbase @6.11.1_1: fatal error: headers not found
MacPorts
- [MacPorts] #74027: qt6-qtbase @6.11.1_1: fatal error: headers not found
MacPorts
- [MacPorts] #74080: pandoc at 3.9.0.2 upgrade (build from source) fails; Tahoe 26.5.1 arm64
MacPorts
- [MacPorts] #74079: opencv4-devel: fails to build (was: Error: Failed to build opencv4-devel: command execution failed)
MacPorts
- [MacPorts] #74080: pandoc at 3.9.0.2 upgrade (build from source) fails; Tahoe 26.5.1 arm64
MacPorts
- [MacPorts] #74080: pandoc at 3.9.0.2 upgrade (build from source) fails; Tahoe 26.5.1 arm64
MacPorts
- [MacPorts] #74080: pandoc at 3.9.0.2 upgrade (build from source) fails; Tahoe 26.5.1 arm64
MacPorts
- [MacPorts] #72166: hdf5 @1.16.0+cxx+fortran+gcc5+hl+universal: Internal compiler error: Error reporting routines re-entered.
MacPorts
- [MacPorts] #74078: libheif fails to build on high sierra
MacPorts
- [MacPorts] #74081: Error: Failed to build pandoc: command execution failed
MacPorts
- [MacPorts] #74081: Error: Failed to build pandoc: command execution failed
MacPorts
- [MacPorts] #74081: Error: Failed to build pandoc: command execution failed
MacPorts
- [MacPorts] #74082: kotlin-language-server: deprecated, switch to official successor
MacPorts
- [MacPorts] #74082: kotlin-language-server: deprecated, switch to official successor
MacPorts
- [MacPorts] #74083: octave at 11.3.0 fails; arm64, Tahoe 26.5.1: Undefined control sequence
MacPorts
- [MacPorts] #74083: octave at 11.3.0 fails; arm64, Tahoe 26.5.1: Undefined control sequence
MacPorts
- [MacPorts] #74084: quodlibet @4.7.1 crashes on startup (Python reports None exception)
MacPorts
- [MacPorts] #74084: quodlibet @4.7.1 crashes on startup (Python reports None exception)
MacPorts
- [MacPorts] #74084: quodlibet @4.7.1 crashes on startup (Python reports None exception)
MacPorts
- [MacPorts] #74085: dosbox-staging fails to build on Leopard/ppc32
MacPorts
- [MacPorts] #74085: dosbox-staging fails to build on Leopard/ppc32
MacPorts
- [MacPorts] #74086: nmap fails to build on Leopard/ppc32
MacPorts
- [MacPorts] #74086: nmap fails to build on Leopard/ppc32
MacPorts
- [MacPorts] #74084: quodlibet @4.7.1 crashes on startup (Python reports None exception)
MacPorts
- [MacPorts] #74087: pandoc @3.9.0.2_1 fails to build: --allow-newer pulls in incompatible typst 0.10
MacPorts
- [MacPorts] #74084: quodlibet @4.7.1 crashes on startup (Python reports None exception)
MacPorts
- [MacPorts] #74087: pandoc @3.9.0.2_1 fails to build: --allow-newer pulls in incompatible typst 0.10
MacPorts
- [MacPorts] #74040: arm64 build machine is offline
MacPorts
- [MacPorts] #74087: pandoc @3.9.0.2_1 fails to build: --allow-newer pulls in incompatible typst 0.10
MacPorts
- [MacPorts] #74081: pandoc @3.9.0.2_1: Failed to build (was: Error: Failed to build pandoc: command execution failed)
MacPorts
- [MacPorts] #74085: dosbox-staging @0.80.1_1 fails to build on Leopard/ppc32 (was: dosbox-staging fails to build on Leopard/ppc32)
MacPorts
- [MacPorts] #74086: nmap fails to build on Leopard/ppc32
MacPorts
- [MacPorts] #74088: apr-util @1.6.3 : Compile error : apr-util-1.6.3/dbm/sdbm/sdbm_pair.c
MacPorts
- [MacPorts] #74088: apr-util @1.6.3 : Compile error : apr-util-1.6.3/dbm/sdbm/sdbm_pair.c
MacPorts
- [MacPorts] #74080: pandoc at 3.9.0.2 upgrade (build from source) fails; Tahoe 26.5.1 arm64
MacPorts
- [MacPorts] #74080: pandoc at 3.9.0.2 upgrade (build from source) fails; Tahoe 26.5.1 arm64
MacPorts
- [MacPorts] #74080: pandoc at 3.9.0.2 upgrade (build from source) fails; Tahoe 26.5.1 arm64
MacPorts
- [MacPorts] #74080: pandoc at 3.9.0.2 upgrade (build from source) fails; Tahoe 26.5.1 arm64
MacPorts
- [MacPorts] #74088: apr-util @1.6.3 : Compile error : apr-util-1.6.3/dbm/sdbm/sdbm_pair.c
MacPorts
- [MacPorts] #74070: opencv4 @4.9.0_9: build failure when ffmpeg is active
MacPorts
- [MacPorts] #74083: octave at 11.3.0 fails; arm64, Tahoe 26.5.1: Undefined control sequence
MacPorts
- [MacPorts] #74083: octave at 11.3.0 fails; arm64, Tahoe 26.5.1: Undefined control sequence
MacPorts
- [MacPorts] #69214: qt6: *.pc files required by pkg-config are missing
MacPorts
- [MacPorts] #74078: libheif fails to build on high sierra
MacPorts
- [MacPorts] #74078: libheif fails to build on high sierra
MacPorts
- [MacPorts] #74070: opencv4 @4.9.0_9: build failure when ffmpeg is active
MacPorts
- [MacPorts] #74083: octave at 11.3.0 fails; arm64, Tahoe 26.5.1: Undefined control sequence
MacPorts
- [MacPorts] #74077: mlx-c 0.6.0_1 fails with CMake Error at /opt/local/share/cmake/MLX/MLXConfig.cmake:49
MacPorts
- [MacPorts] #74078: libheif fails to build on high sierra
MacPorts
- [MacPorts] #74077: mlx-c 0.6.0_1 fails with CMake Error at /opt/local/share/cmake/MLX/MLXConfig.cmake:49
MacPorts
- [MacPorts] #74077: mlx-c 0.6.0_1 fails with CMake Error at /opt/local/share/cmake/MLX/MLXConfig.cmake:49
MacPorts
- [MacPorts] #74078: libheif fails to build on high sierra
MacPorts
- [MacPorts] #74078: libheif fails to build on high sierra
MacPorts
- [MacPorts] #71225: pandoc @3.4_1+full_latex_dependencies+texlive fails to build
MacPorts
- [MacPorts] #74081: pandoc @3.9.0.2_1: Failed to build
MacPorts
- [MacPorts] #72344: svt-av1 @3.0.2 - failed to build
MacPorts
- [MacPorts] #74089: ack Failed to extract ack
MacPorts
- [MacPorts] #74081: pandoc @3.9.0.2_1: Failed to build
MacPorts
- [MacPorts] #74089: ack Failed to extract ack
MacPorts
- [MacPorts] #74070: opencv4 @4.9.0_9: build failure when ffmpeg is active
MacPorts
- [MacPorts] #74070: opencv4 @4.9.0_9: build failure when ffmpeg is active
MacPorts
- [MacPorts] #74070: opencv4 @4.9.0_9: build failure when ffmpeg is active
MacPorts
- [MacPorts] #74070: opencv4 @4.9.0_9: build failure when ffmpeg is active
MacPorts
- [MacPorts] #74078: libheif fails to build on high sierra
MacPorts
- [MacPorts] #74090: Error: Failed to build opencv4: command execution failed
MacPorts
- [MacPorts] #71725: ack @3.8.1 does not extract on macOS 10.11.6, it's OK on buildbots
MacPorts
- [MacPorts] #74091: libmed @4.1.1 fails to configure against current hdf5
MacPorts
- [MacPorts] #74091: libmed @4.1.1 fails to configure against current hdf5
MacPorts
- [MacPorts] #70540: senpai
MacPorts
- [MacPorts] #74078: libheif fails to build on high sierra
MacPorts
- [MacPorts] #73927: evince @3.36.7_5: Fails to autoreconf
MacPorts
- [MacPorts] #70540: senpai
MacPorts
- [MacPorts] #66250: libunwind: Causes other ports to fail to build
MacPorts
- [MacPorts] #74092: curl-ca-bundle @ 8.20.0_0: Failed to fetch curl-ca-bundle: Failed to fetch distfiles
MacPorts
- [MacPorts] #74078: libheif fails to build on high sierra
MacPorts
- [MacPorts] #74078: libheif fails to build on high sierra
MacPorts
- [MacPorts] #74093: Errors in 'port upgrade curl'
MacPorts
- [MacPorts] #74093: Errors in 'port upgrade curl'
MacPorts
- [MacPorts] #74092: curl-ca-bundle @ 8.20.0_0: Failed to fetch curl-ca-bundle: Failed to fetch distfiles
MacPorts
- [MacPorts] #74092: curl-ca-bundle @ 8.20.0_0: Failed to fetch curl-ca-bundle: Failed to fetch distfiles
MacPorts
- [MacPorts] #74093: Errors in 'port upgrade curl'
MacPorts
- [MacPorts] #74093: Errors in 'port upgrade curl'
MacPorts
- [MacPorts] #74093: Errors in 'port upgrade curl'
MacPorts
- [MacPorts] #74093: Errors in 'port upgrade curl'
MacPorts
- [MacPorts] #74094: Errors in port commands
MacPorts
- [MacPorts] #74094: Reclaimed build dependencies are installed again when building (was: Errors in port commands)
MacPorts
- [MacPorts] #74095: ffmpeg8 @8.1_1 missing `--enable-libharfbuzz` flag breaks drawtext filter
MacPorts
- [MacPorts] #74095: ffmpeg8 @8.1_1 missing `--enable-libharfbuzz` flag breaks drawtext filter
MacPorts
- [MacPorts] #73455: findutils: cannot use locate; updatedb apparently fails to do anything useful!
MacPorts
- [MacPorts] #74095: ffmpeg8 @8.1_1 missing `--enable-libharfbuzz` flag breaks drawtext filter
MacPorts
- [MacPorts] #74096: libmed @4.1.1_5+gfortran: Build failure, possible HDF5 library version incompatibility
MacPorts
- [MacPorts] #74096: libmed @4.1.1_5+gfortran: Build failure, possible HDF5 library version incompatibility
MacPorts
- [MacPorts] #74097: python314+experimental_jit has a circular dependency via clang-19→ninja
MacPorts
- [MacPorts] #74098: llvm-19 (and probably llvm-20, and perhaps older versions) can’t be built by clang-21
MacPorts
- Re: [MacPorts] #74098: llvm-19 (and probably llvm-20, and perhaps older versions) can’t be built by clang-21 (Xcode 26.4) (was: llvm-19 (and probably llvm-20, and perhaps older versions) can’t be built by clang-21)
MacPorts
- Re: [MacPorts] #74098: llvm-19 (and probably llvm-20, and perhaps older versions) can’t be built by clang-21 (Xcode 26.4)
MacPorts
- Re: [MacPorts] #74098: CLOSE THIS BUG: llvm-19 (and probably llvm-20, and perhaps older versions) can’t be built by clang-21 (Xcode 26.4) (was: llvm-19 (and probably llvm-20, and perhaps older versions) can’t be built by clang-21 (Xcode 26.4))
MacPorts
- [MacPorts] #74094: Reclaimed build dependencies are installed again when building
MacPorts
- [MacPorts] #73455: findutils: cannot use locate; updatedb apparently fails to do anything useful!
MacPorts
- [MacPorts] #74099: Failed to build tailscale: command execution failed
MacPorts
- [MacPorts] #74100: Binary file corruption for clang-20 on macOS Ventura (Darwin 22)
MacPorts
- [MacPorts] #74100: Binary file corruption for clang-20 on macOS Ventura (Darwin 22)
MacPorts
- [MacPorts] #74099: Failed to build tailscale: command execution failed
MacPorts
- Re: [MacPorts] #74098: CLOSE THIS BUG: llvm-19 (and probably llvm-20, and perhaps older versions) can’t be built by clang-21 (Xcode 26.4)
MacPorts
- [MacPorts] #72814: cadaver @0.24: incompatible neon library version 0.33.0: wanted 0.27 28 29 30 31 32
MacPorts
- [MacPorts] #74094: Reclaimed build dependencies are installed again when building
MacPorts
- Re: [MacPorts] #74097: python314+experimental_jit has a circular dependency via clang-19→ninja
MacPorts
- [MacPorts] #74100: Binary file corruption for clang-20 on macOS Ventura (Darwin 22)
MacPorts
- [MacPorts] #74074: netcdf @4.10.0 missing CDF5 support on arm64 builds
MacPorts
- [MacPorts] #74101: MacPorts 2.12.99 multiple errors on MacOS 27 beta
MacPorts
- [MacPorts] #74101: MacPorts 2.12.99 multiple errors on MacOS 27 beta
MacPorts
- [MacPorts] #74077: mlx-c 0.6.0_1 fails with CMake Error at /opt/local/share/cmake/MLX/MLXConfig.cmake:49
MacPorts
- [MacPorts] #74101: MacPorts 2.12.99 multiple errors on MacOS 27 beta
MacPorts
- [MacPorts] #74101: MacPorts 2.12.99 multiple errors on MacOS 27 beta
MacPorts
- [MacPorts] #74101: MacPorts 2.12.99 multiple errors on MacOS 27 beta
MacPorts
- [MacPorts] #74101: MacPorts 2.12.99 multiple errors on MacOS 27 beta
MacPorts
- [MacPorts] #74101: MacPorts 2.12.99 multiple errors on MacOS 27 beta
MacPorts
- [MacPorts] #74101: MacPorts 2.12.99 multiple errors on MacOS 27 beta
MacPorts
- [MacPorts] #74101: MacPorts 2.12.99 multiple errors on MacOS 27 beta
MacPorts
- [MacPorts] #74101: MacPorts 2.12.99 multiple errors on MacOS 27 beta
MacPorts
- [MacPorts] #74101: MacPorts 2.12.99 multiple errors on MacOS 27 beta
MacPorts
- [MacPorts] #74101: MacPorts 2.12.99 multiple errors on MacOS 27 beta
MacPorts
- [MacPorts] #74101: MacPorts 2.12.99 multiple errors on MacOS 27 beta
MacPorts
- [MacPorts] #74101: MacPorts 2.12.99 multiple errors on MacOS 27 beta
MacPorts
- [MacPorts] #74101: MacPorts 2.12.99 multiple errors on MacOS 27 beta
MacPorts
- [MacPorts] #74096: libmed @4.1.1_5+gfortran: Build failure, possible HDF5 library version incompatibility
MacPorts
- [MacPorts] #74091: libmed @4.1.1 fails to configure against current hdf5
MacPorts
- [MacPorts] #74094: Reclaimed build dependencies are installed again when building
MacPorts
- [MacPorts] #74040: arm64 build machine is offline
MacPorts
- [MacPorts] #74078: libheif fails to build on high sierra
MacPorts
- [MacPorts] #70954: Pandoc should not install texlive if MacTex is already installed
MacPorts
- [MacPorts] #74090: Error: Failed to build opencv4: command execution failed
MacPorts
- [MacPorts] #71394: texlive-bin-extra @70579 has too many dependencies of Perl Modules
MacPorts
- [MacPorts] #69826: luametatex @2.11.02 does not build on PPC Leopard, Mac OS X 10.5.8, because of unrecognized command line option "-Wno-unused-result"
MacPorts
- [MacPorts] #74064: (10.14) failed to upgradge > rust
MacPorts
- [MacPorts] #74102: Rust source build failing checksum
MacPorts
- [MacPorts] #74102: Rust source build failing checksum
MacPorts
- [MacPorts] #74102: Rust source build failing checksum
MacPorts
- [MacPorts] #74102: Rust source build failing checksum
MacPorts
- [MacPorts] #74078: libheif fails to build on high sierra
MacPorts
- [MacPorts] #74103: fontconfig @2.17.1 and @2.18.1 insanely search for font files in /System/Library/Assets{, V2}
MacPorts
- [MacPorts] #74103: fontconfig @2.17.1 and @2.18.1 insanely search for font files in /System/Library/Assets{, V2}
MacPorts
- [MacPorts] #74101: MacPorts 2.12.99 multiple errors on MacOS 27 beta
MacPorts
- [MacPorts] #74104: Error while updating QGIS using MacPorts
MacPorts
- [MacPorts] #74078: libheif fails to build on high sierra
MacPorts
- [MacPorts] #74078: libheif fails to build on high sierra
MacPorts
- [MacPorts] #74053: Update neomutt
MacPorts
- [MacPorts] #74105: neomutt: Fixing builds on old system
MacPorts
- [MacPorts] #61557: neomutt @20200925_0 w3m help / header cache problem / no authenticators
MacPorts
- [MacPorts] #73660: Ports abandoned by michaelld
MacPorts
- [MacPorts] #74106: giflib5 @5.2.2₃ does not build on PPC Leopard, Mac OS X 10.5.8, because of cc1: error: unrecognized command line option "-Wno-format-truncation"
MacPorts
- Re: [MacPorts] #74106: giflib5 @5.2.2₃ does not build on PPC Leopard, Mac OS X 10.5.8, because of cc1: error: unrecognized command line option "-Wno-format-truncation"
MacPorts
- Re: [MacPorts] #74106: giflib5 @5.2.2₃ does not build on PPC Leopard, Mac OS X 10.5.8, because of cc1: error: unrecognized command line option "-Wno-format-truncation"
MacPorts
- Re: [MacPorts] #74106: giflib5 @5.2.2₃ does not build on PPC Leopard, Mac OS X 10.5.8, because of cc1: error: unrecognized command line option "-Wno-format-truncation"
MacPorts
- [MacPorts] #74078: libheif fails to build on high sierra
MacPorts
- [MacPorts] #74078: libheif fails to build on high sierra
MacPorts
- [MacPorts] #74078: libheif fails to build on high sierra
MacPorts
- [MacPorts] #74107: opencv4 link failure with ffmpeg4
MacPorts
- [MacPorts] #74107: opencv4 link failure with ffmpeg4
MacPorts
- [MacPorts] #74107: opencv4 link failure with ffmpeg4
MacPorts
- [MacPorts] #74103: fontconfig @2.17.1 and @2.18.1 insanely search for font files in /System/Library/Assets{, V2}
MacPorts
- [MacPorts] #74100: Binary file corruption for clang-20 on macOS Ventura (Darwin 22)
MacPorts
- [MacPorts] #74073: How to uninstall 'yt-dlp' from MacPorts
MacPorts
- [MacPorts] #74090: Error: Failed to build opencv4: command execution failed
MacPorts
- [MacPorts] #74107: opencv4 link failure with ffmpeg4
MacPorts
- Re: [MacPorts] #73086: Go is broken on 10.13–10.15
MacPorts
- [MacPorts] #74060: mfa Fails to Build -- Symbol not found: _SecTrustCopyCertificateChain
MacPorts
- [MacPorts] #74056: deno-2.8.1 not available on macports mirrors for updating
MacPorts
- [MacPorts] #74053: Update neomutt
MacPorts
- [MacPorts] #74105: neomutt: Fixing builds on old system
MacPorts
- [MacPorts] #66505: texlive-basic @62858_2 misses to install files
MacPorts
- [MacPorts] #66505: texlive-basic @62858_2 misses to install files
MacPorts
- [MacPorts] #71900: texlive-bin @2024.70613_1 does not build on PPC Mac OS X 10.4.11, Tiger, because of implicit declaration of function 'gmtime_r'
MacPorts
- [MacPorts] #70894: texlive-latex-extra conflicts with EMBOSS
MacPorts
- [MacPorts] #70894: texlive-latex-extra conflicts with EMBOSS
MacPorts
- Re: [MacPorts] #74106: giflib5 @5.2.2₃ does not build on PPC Leopard, Mac OS X 10.5.8, because of cc1: error: unrecognized command line option "-Wno-format-truncation"
MacPorts
- [MacPorts] #74108: nss-3.125 does not build on PPC Mac OS X 10.5.8, Leopard, because error: mm_malloc.h: No such file or directory
MacPorts
- [MacPorts] #74108: nss-3.125 does not build on PPC Mac OS X 10.5.8, Leopard, because error: mm_malloc.h: No such file or directory
MacPorts
- [MacPorts] #74108: nss-3.125 does not build on PPC Mac OS X 10.5.8, Leopard, because error: mm_malloc.h: No such file or directory
MacPorts
- [MacPorts] #74103: fontconfig @2.17.1 and @2.18.1 insanely search for font files in /System/Library/Assets{, V2}
MacPorts
- [MacPorts] #74108: nss-3.125 does not build on PPC Mac OS X 10.5.8, Leopard, because error: mm_malloc.h: No such file or directory
MacPorts
- [MacPorts] #73988: btop @1.4.7 does not build on macOS Sonoma 14.8.5 because src/btop_config.cpp:819:24: error: constexpr function's return type 'std::optional<fs::path>' is not a literal type
MacPorts
- [MacPorts] #73660: Ports abandoned by michaelld
MacPorts
- [MacPorts] #73957: rust @1.95.0: error: use of overloaded operator '!=' is ambiguous
MacPorts
- [MacPorts] #74109: glib2 @2.88.1 configure error
MacPorts
- [MacPorts] #74109: glib2 @2.88.1 configure error
MacPorts
- [MacPorts] #74109: glib2 @2.88.1_0+universal+x11 configure error (was: glib2 @2.88.1 configure error)
MacPorts
- [MacPorts] #72279: geneweb build error: Error: File unavailable: /opt/local/lib/ocaml/camlp5/camlp5.cma
MacPorts
- [MacPorts] #74078: libheif fails to build on high sierra
MacPorts
- [MacPorts] #74078: libheif fails to build on high sierra
MacPorts
- [MacPorts] #74073: How to uninstall 'yt-dlp' from MacPorts
MacPorts
- [MacPorts] #74078: libheif fails to build on high sierra
MacPorts
- [MacPorts] #74078: libheif fails to build on high sierra
MacPorts
- [MacPorts] #74010: spyder-313: crashes with a generic looking python error
MacPorts
- [MacPorts] #74078: libheif fails to build on high sierra
MacPorts
- [MacPorts] #74078: libheif fails to build on high sierra
MacPorts
- [MacPorts] #74078: libheif fails to build on high sierra
MacPorts
- [MacPorts] #74078: libheif fails to build on high sierra
MacPorts
- [MacPorts] #74110: angle @2.1.27738 build failure with gcc: IntermNode.cpp: error: default type conversion cannot deduce template argument
MacPorts
- [MacPorts] #74110: angle @2.1.27738 build failure with gcc: IntermNode.cpp: error: default type conversion cannot deduce template argument
MacPorts
- [MacPorts] #74078: libheif fails to build on high sierra
MacPorts
- [MacPorts] #74067: fftw-3 dependency on "openmpi-clang22" not found
MacPorts
- [MacPorts] #74078: libheif fails to build on high sierra
MacPorts
- [MacPorts] #74111: fontconfig 2.18.1 fails to build from source because port tries to extract .xz file with bzip2
MacPorts
- [MacPorts] #74100: Binary file corruption for clang-20 on macOS Ventura (Darwin 22)
MacPorts
- [MacPorts] #73957: rust @1.95.0: error: use of overloaded operator '!=' is ambiguous
MacPorts
- [MacPorts] #74100: Binary file corruption for clang-20 on macOS Ventura (Darwin 22)
MacPorts
- [MacPorts] #74013: mas: mas port lacks man page and wrapper shell script
MacPorts
- [MacPorts] #74013: mas: mas port lacks man page and wrapper shell script
MacPorts
- [MacPorts] #74013: mas: mas port lacks man page and wrapper shell script
MacPorts
- [MacPorts] #74090: Error: Failed to build opencv4: command execution failed
MacPorts
- [MacPorts] #74111: fontconfig 2.18.1 fails to build from source because port tries to extract .xz file with bzip2
MacPorts
- [MacPorts] #74112: erlang @29.0.2: error: 'HAVE_UNISTD_H' is not defined, evaluates to 0 [-Werror, -Wundef]
MacPorts
- [MacPorts] #74111: fontconfig 2.18.1 fails to build from source because port tries to extract .xz file with bzip2
MacPorts
- [MacPorts] #74111: fontconfig@ 2.18.1: fails to build from source because port tries to extract .xz file with bzip2 (was: fontconfig 2.18.1 fails to build from source because port tries to extract .xz file with bzip2)
MacPorts
- [MacPorts] #74078: libheif @1.23.0: error: no member named 'ranges' in namespace 'std' (was: libheif fails to build on high sierra)
MacPorts
- [MacPorts] #74111: fontconfig@ 2.18.1: fails to build from source because port tries to extract .xz file with bzip2
MacPorts
- [MacPorts] #72437: base check for noarch is misleading
MacPorts
- [MacPorts] #67163: m68k-elf-gcc: fails to build on macOS/arm64 13.2.1 (config.sub: invalid option -apple-darwin22.3.0)
MacPorts
- [MacPorts] #67162: mips-elf-gcc: build fails on macOS/arm64 (Invalid configuration `arm64-apple-darwin22.3.0': machine `arm64-apple' not recognized)
MacPorts
- [MacPorts] #74078: libheif @1.23.0: error: no member named 'ranges' in namespace 'std'
MacPorts
- [MacPorts] #74113: MacPorts @master: couldn't sync the ports tree: can't read "cur_uid": no such variable
MacPorts
- [MacPorts] #74078: libheif @1.23.0: error: no member named 'ranges' in namespace 'std'
MacPorts
- [MacPorts] #74111: fontconfig@ 2.18.1: fails to build from source because port tries to extract .xz file with bzip2
MacPorts
- [MacPorts] #74113: MacPorts @master: couldn't sync the ports tree: can't read "cur_uid": no such variable
MacPorts
- [MacPorts] #74111: fontconfig@ 2.18.1: fails to build from source because port tries to extract .xz file with bzip2
MacPorts
- [MacPorts] #74114: Error: Failed to build py314-opencv4: command execution failed
MacPorts
- [MacPorts] #74078: libheif @1.23.0: error: no member named 'ranges' in namespace 'std'
MacPorts
- [MacPorts] #73940: ncurses @6.6 does not build if `gawk` port is activated
MacPorts
- [MacPorts] #74114: Error: Failed to build py314-opencv4: command execution failed
MacPorts
- [MacPorts] #73940: ncurses @6.6 does not build if `gawk` port is activated
MacPorts
- [MacPorts] #57427: gnucash @3.3.0 upgrade fails due to unknown option "-Wno-register"
MacPorts
- [MacPorts] #63397: gnucash 4.6 cannot install, cmakefile patches fail
MacPorts
- [MacPorts] #67722: gnucash @5.3: error: no member named 'merge' in 'std::__1::map
MacPorts
- [MacPorts] #59209: gnucash 3.6 fails to build
MacPorts
- [MacPorts] #39680: stog: dependency on texlive-bin is likely incorrect
MacPorts
- [MacPorts] #51456: gnucash build failure with guile and guile18 installed
MacPorts
- [MacPorts] #73940: ncurses @6.6 does not build if `gawk` port is activated
MacPorts
- [MacPorts] #73940: ncurses @6.6 does not build if `gawk` port is activated
MacPorts
- [MacPorts] #46845: Gnucash @ 2.6.5 Fails when printing Invoice
MacPorts
- [MacPorts] #43189: No latex-previews when using pgf 3.0.0 in emacs-app
MacPorts
- [MacPorts] #57425: emacs-app or emacs-app-devel crashes on menu access with Tramp file open
MacPorts
- [MacPorts] #57931: emacs-app-devel @20190111_0: menu bar requires 2 clicks, is unresponsive, or has delays
MacPorts
- [MacPorts] #60391: emacs-app @26.3_5 +imagemagick: Startup Crash
MacPorts
- [MacPorts] #74115: tor-devel @0.4.8.13+universal: Remove the port
MacPorts
- [MacPorts] #74115: tor-devel @0.4.8.13+universal: Remove the port
MacPorts
- [MacPorts] #74115: tor-devel @0.4.8.13+universal: Remove the port
MacPorts
- [MacPorts] #74096: libmed @4.1.1_5+gfortran: Build failure, possible HDF5 library version incompatibility
MacPorts
- [MacPorts] #74096: libmed @4.1.1_5+gfortran: Build failure, possible HDF5 library version incompatibility
MacPorts
- [MacPorts] #73957: rust @1.95.0: error: use of overloaded operator '!=' is ambiguous
MacPorts
- [MacPorts] #73957: rust @1.95.0: error: use of overloaded operator '!=' is ambiguous
MacPorts
- [MacPorts] #74096: libmed @4.1.1_5+gfortran: Build failure, possible HDF5 library version incompatibility
MacPorts
- [MacPorts] #74116: Error: Failed to build source-highlight: command execution failed
MacPorts
- [MacPorts] #74116: Error: Failed to build source-highlight: command execution failed
MacPorts
- [MacPorts] #74114: Error: Failed to build py314-opencv4: command execution failed
MacPorts
- [MacPorts] #74114: Error: Failed to build py314-opencv4: command execution failed
MacPorts
- [MacPorts] #74117: rust @1.96.0 fails to build on Darwin 27.0 (macOS Golden Gate): can't find crate for clap_derive
MacPorts
- [MacPorts] #74117: rust @1.96.0 fails to build on Darwin 27.0 (macOS Golden Gate): can't find crate for clap_derive
MacPorts
- [MacPorts] #29794: emacs-app @23.3_0 Problem using tramp in emacs.app: "ControlPath too long"
MacPorts
- [MacPorts] #43878: emacs hangs when executing 'gnus'
MacPorts
- [MacPorts] #50231: emacs-app does not emulate three-button mouse
MacPorts
- [MacPorts] #74117: rust @1.96.0 fails to build on Darwin 27.0 (macOS Golden Gate): can't find crate for clap_derive
MacPorts
- [MacPorts] #74118: R-Matrix grief on Tahoe 26.5.1 ARM
MacPorts
- [MacPorts] #61406: emacs @27.1_2+x11: dyld: lazy symbol binding failed: Symbol not found: _aligned_alloc
MacPorts
- [MacPorts] #63994: emacs-app-devel: The installed libgccjit failed to compile and run a test program using the libgccjit library
MacPorts
- [MacPorts] #68382: emacs fails to build in default configuration of +nativecomp on i386 10.6 Snow Leopard as libgccjit is unavailable
MacPorts
- [MacPorts] #74057: emacs-app fails to find gcc driver
MacPorts
- [MacPorts] #74008: emacs-app @30.2_7 errors out when calling libgccjit
MacPorts
- [MacPorts] #74057: emacs-app fails to find gcc driver
MacPorts
- [MacPorts] #73985: starship port fails due to rust ?!
MacPorts
- [MacPorts] #74078: libheif @1.23.0: error: no member named 'ranges' in namespace 'std'
MacPorts
- [MacPorts] #74078: libheif @1.23.0: error: no member named 'ranges' in namespace 'std'
MacPorts
- [MacPorts] #74078: libheif @1.23.0: error: no member named 'ranges' in namespace 'std'
MacPorts
- [MacPorts] #74109: glib2 @2.88.1_0+universal+x11 configure error
MacPorts
- [MacPorts] #74116: Error: Failed to build source-highlight: command execution failed
MacPorts
- [MacPorts] #74118: R-Matrix grief on Tahoe 26.5.1 ARM
MacPorts
- [MacPorts] #74096: libmed @4.1.1_5+gfortran: Build failure, possible HDF5 library version incompatibility
MacPorts
- [MacPorts] #74091: libmed @4.1.1 fails to configure against current hdf5
MacPorts
- [MacPorts] #74096: libmed @4.1.1_5+gfortran: Build failure, possible HDF5 library version incompatibility
MacPorts
- [MacPorts] #74096: libmed @4.1.1_5+gfortran: Build failure, possible HDF5 library version incompatibility
MacPorts
- [MacPorts] #74096: libmed @4.1.1_5+gfortran: Build failure, possible HDF5 library version incompatibility
MacPorts
- [MacPorts] #74091: libmed @4.1.1 fails to configure against current hdf5
MacPorts
- [MacPorts] #72213: lhasa (tool for extracting LHA archives)
MacPorts
- [MacPorts] #72583: emacs-app @30.1_1+nativecomp+rsvg+treesitter launches multiple bash processes that do not terminate
MacPorts
- [MacPorts] #74008: emacs-app @30.2_7 errors out when calling libgccjit
MacPorts
- [MacPorts] #74057: emacs-app fails to find gcc driver
MacPorts
- [MacPorts] #74008: emacs-app @30.2_7 errors out when calling libgccjit
MacPorts
- [MacPorts] #64331: emacs-app-devel: problems with native compilation
MacPorts
- [MacPorts] #65546: Emacs: strange behavior of menu bar (and tool bar)
MacPorts
- [MacPorts] #74091: libmed @4.1.1 fails to configure against current hdf5
MacPorts
- [MacPorts] #74096: libmed @4.1.1_5+gfortran: Build failure, possible HDF5 library version incompatibility
MacPorts
- [MacPorts] #74114: Error: Failed to build py314-opencv4: command execution failed
MacPorts
- [MacPorts] #74104: Error while updating QGIS using MacPorts
MacPorts
- [MacPorts] #74070: opencv4 @4.9.0_9: build failure when ffmpeg is active
MacPorts
- [MacPorts] #74107: opencv4 link failure with ffmpeg4
MacPorts
- [MacPorts] #74090: Error: Failed to build opencv4: command execution failed
MacPorts
- [MacPorts] #74119: base (master) gives error for 'sudo port rev-upgrade'
MacPorts
- [MacPorts] #74120: Error: Failed to build libheif: command execution failed
MacPorts
- [MacPorts] #74120: Error: Failed to build libheif: command execution failed
MacPorts
- [MacPorts] #74078: libheif @1.23.0: error: no member named 'ranges' in namespace 'std'
MacPorts
- [MacPorts] #74070: opencv4 @4.9.0_9: build failure when ffmpeg is active
MacPorts
- [MacPorts] #69214: qt6: *.pc files required by pkg-config are missing
MacPorts
- [MacPorts] #74116: Error: Failed to build source-highlight: command execution failed
MacPorts
- [MacPorts] #74119: base (master) gives error for 'sudo port rev-upgrade'
MacPorts
- [MacPorts] #73987: nodejs24: where is npm??
MacPorts
- [MacPorts] #72469: wxmaxima does not open a file dialog so it can't save files
MacPorts
- [MacPorts] #74121: nodejs*, npm*: Improve descriptions
MacPorts
- [MacPorts] #71232: emacs-app-devel: The application "Finder" does not have permission to open "(null)"
MacPorts
- [MacPorts] #67545: gnucash @5.0_1: error: no template named 'unary_function' in namespace 'std'
MacPorts
- [MacPorts] #74122: py314-pikepdf @10.8.0: /bin/sh: CMAKE_CXX_COMPILER_CLANG_SCAN_DEPS-NOTFOUND: command not found
MacPorts
- [MacPorts] #66355: arm-none-eabi-gcc: add newlib nano support
MacPorts
- [MacPorts] #74123: portfile.7: :Usage: .Ic interactive_command ... (#1313)
MacPorts
- [MacPorts] #74124: gnupg2 @2.5.20 does not build on PPC Leopard, Mac OS X 10.5.8, because of error: implicit declaration of function 'fdopendir'
MacPorts
- [MacPorts] #74124: gnupg2 @2.5.20 does not build on PPC Leopard, Mac OS X 10.5.8, because of error: implicit declaration of function 'fdopendir'
MacPorts
- [MacPorts] #74124: gnupg2 @2.5.20 does not build on PPC Leopard, Mac OS X 10.5.8, because of error: implicit declaration of function 'fdopendir'
MacPorts
- [MacPorts] #74124: gnupg2 @2.5.20 does not build on PPC Leopard, Mac OS X 10.5.8, because of error: implicit declaration of function 'fdopendir'
MacPorts
- [MacPorts] #74124: gnupg2 @2.5.20 does not build on PPC Leopard, Mac OS X 10.5.8, because of error: implicit declaration of function 'fdopendir'
MacPorts
- [MacPorts] #74122: py314-pikepdf @10.8.0: /bin/sh: CMAKE_CXX_COMPILER_CLANG_SCAN_DEPS-NOTFOUND: command not found
MacPorts
- [MacPorts] #74124: gnupg2 @2.5.20 does not build on PPC Leopard, Mac OS X 10.5.8, because of error: implicit declaration of function 'fdopendir'
MacPorts
- [MacPorts] #74123: portfile.7: :Usage: .Ic interactive_command ... (#1313)
MacPorts
- [MacPorts] #74123: portfile.7: :Usage: .Ic interactive_command ... (#1313)
MacPorts
- [MacPorts] #74124: gnupg2 @2.5.20 does not build on PPC Leopard, Mac OS X 10.5.8, because of error: implicit declaration of function 'fdopendir'
MacPorts
- [MacPorts] #74124: gnupg2 @2.5.20 does not build on PPC Leopard, Mac OS X 10.5.8, because of error: implicit declaration of function 'fdopendir'
MacPorts
- [MacPorts] #74124: gnupg2 @2.5.20 does not build on PPC Leopard, Mac OS X 10.5.8, because of error: implicit declaration of function 'fdopendir'
MacPorts
- [MacPorts] #74124: gnupg2 @2.5.20 does not build on PPC Leopard, Mac OS X 10.5.8, because of error: implicit declaration of function 'fdopendir'
MacPorts
- [MacPorts] #74124: gnupg2 @2.5.20 does not build on PPC Leopard, Mac OS X 10.5.8, because of error: implicit declaration of function 'fdopendir'
MacPorts
- [MacPorts] #74116: Error: Failed to build source-highlight: command execution failed
MacPorts
- [MacPorts] #74124: gnupg2 @2.5.20 does not build on PPC Leopard, Mac OS X 10.5.8, because of error: implicit declaration of function 'fdopendir'
MacPorts
- [MacPorts] #74124: gnupg2 @2.5.20 does not build on PPC Leopard, Mac OS X 10.5.8, because of error: implicit declaration of function 'fdopendir'
MacPorts
- [MacPorts] #74124: gnupg2 @2.5.20 does not build on PPC Leopard, Mac OS X 10.5.8, because of error: implicit declaration of function 'fdopendir'
MacPorts
- [MacPorts] #74124: gnupg2 @2.5.20 does not build on PPC Leopard, Mac OS X 10.5.8, because of error: implicit declaration of function 'fdopendir'
MacPorts
- [MacPorts] #74124: gnupg2 @2.5.20 does not build on PPC Leopard, Mac OS X 10.5.8, because of error: implicit declaration of function 'fdopendir'
MacPorts
- [MacPorts] #74124: gnupg2 @2.5.20 does not build on PPC Leopard, Mac OS X 10.5.8, because of error: implicit declaration of function 'fdopendir'
MacPorts
- [MacPorts] #73167: libgcc15 can't find "md-unwind-def.h" (10.5.8)
MacPorts
- [MacPorts] #74124: gnupg2 @2.5.20 does not build on PPC Leopard, Mac OS X 10.5.8, because of error: implicit declaration of function 'fdopendir'
MacPorts
- [MacPorts] #74124: gnupg2 @2.5.20 does not build on PPC Leopard, Mac OS X 10.5.8, because of error: implicit declaration of function 'fdopendir'
MacPorts
- [MacPorts] #74124: gnupg2 @2.5.20 does not build on PPC Leopard, Mac OS X 10.5.8, because of error: implicit declaration of function 'fdopendir'
MacPorts
- [MacPorts] #72454: emacs-app @30.1 +imagemagick +treesitter +nativecamp +rsvg: call to undeclared function 'IOMainPort'
MacPorts
- [MacPorts] #74124: gnupg2 @2.5.20 does not build on PPC Leopard, Mac OS X 10.5.8, because of error: implicit declaration of function 'fdopendir'
MacPorts
- [MacPorts] #67161: ipmitool @1.8.19: fetches a file at build time
MacPorts
- [MacPorts] #67161: ipmitool @1.8.19: fetches a file at build time
MacPorts
- [MacPorts] #72248: gwenhywfar5 @5.12.0: implicit function declarations and incompatible function pointer types
MacPorts
- [MacPorts] #72239: emacs-app: error: expected a type
MacPorts
- [MacPorts] #74125: libhsts won't upgrade on either macOS Sierra or Catalina
MacPorts
- [MacPorts] #74126: port -d selfupdate fail with MacPorts 2.10.5 & Big Sur 11.7.8
MacPorts
- [MacPorts] #74126: port -d selfupdate fail with MacPorts 2.10.5 & Big Sur 11.7.8
MacPorts
- [MacPorts] #74126: port -d selfupdate fail with MacPorts 2.10.5 & Big Sur 11.7.8
MacPorts
- [MacPorts] #74125: libhsts won't upgrade on either macOS Sierra or Catalina
MacPorts
- [MacPorts] #74125: libhsts @0.1.0: *** found more than one invocation of AM_GNU_GETTEXT_VERSION (was: libhsts won't upgrade on either macOS Sierra or Catalina)
MacPorts
- [MacPorts] #74126: port -d selfupdate fail with MacPorts 2.10.5 & Big Sur 11.7.8
MacPorts
- [MacPorts] #74078: libheif @1.23.0: error: no member named 'ranges' in namespace 'std'
MacPorts
- [MacPorts] #74078: libheif @1.23.0: error: no member named 'ranges' in namespace 'std'
MacPorts
- [MacPorts] #74125: libhsts @0.1.0: *** found more than one invocation of AM_GNU_GETTEXT_VERSION
MacPorts
- [MacPorts] #74126: port -d selfupdate fail with MacPorts 2.10.5 & Big Sur 11.7.8
MacPorts
- [MacPorts] #74078: libheif @1.23.0: error: no member named 'ranges' in namespace 'std'
MacPorts
- [MacPorts] #74126: port -d selfupdate fail with MacPorts 2.10.5 & Big Sur 11.7.8
MacPorts
- [MacPorts] #74127: njs: port request
MacPorts
- [MacPorts] #74073: How to uninstall 'yt-dlp' from MacPorts
MacPorts
- [MacPorts] #74073: How to uninstall 'yt-dlp' from MacPorts
MacPorts
- [MacPorts] #74073: How to uninstall 'yt-dlp' from MacPorts
MacPorts
- [MacPorts] #74128: py314-bqscales @0.3.7: ERROR Missing dependencies:
MacPorts
- [MacPorts] #74129: arti 2.4.0: Provide launchd facilities for arti
MacPorts
- [MacPorts] #74130: py310-matplotlib 3.11.0: py310-matplotlib broken by bump of py-matplotlib to matplotlib 3.11 which requires python >=3.11
MacPorts
- [MacPorts] #74128: py314-bqscales @0.3.7: ERROR Missing dependencies:
MacPorts
- [MacPorts] #74130: py310-matplotlib: pin to latest supported version (was: py310-matplotlib 3.11.0: py310-matplotlib broken by bump of py-matplotlib to matplotlib 3.11 which requires python >=3.11)
MacPorts
- [MacPorts] #74130: py310-matplotlib: pin to latest supported version
MacPorts
- [MacPorts] #74130: py310-matplotlib: pin to latest supported version
MacPorts
- [MacPorts] #74131: we are facing issue will running the program
MacPorts
- [MacPorts] #71092: tecla @1.6.3: error: incompatible function pointer types passing 'TputsRetType (TputsArgType)' (aka 'void (int)') to parameter of type 'int (*)(int)' [-Wincompatible-function-pointer-types]
MacPorts
- [MacPorts] #74130: py310-matplotlib: pin to latest supported version
MacPorts
- [MacPorts] #74126: port -d selfupdate fail with MacPorts 2.10.5 & Big Sur 11.7.8
MacPorts
- [MacPorts] #74126: port -d selfupdate fail with MacPorts 2.10.5 & Big Sur 11.7.8
MacPorts
- [MacPorts] #74122: py314-pikepdf @10.8.0: /bin/sh: CMAKE_CXX_COMPILER_CLANG_SCAN_DEPS-NOTFOUND: command not found
MacPorts
- [MacPorts] #74122: py314-pikepdf @10.8.0: /bin/sh: CMAKE_CXX_COMPILER_CLANG_SCAN_DEPS-NOTFOUND: command not found
MacPorts
- [MacPorts] #74131: we are facing issue will running the program
MacPorts
- [MacPorts] #74122: py314-pikepdf @10.8.0: /bin/sh: CMAKE_CXX_COMPILER_CLANG_SCAN_DEPS-NOTFOUND: command not found
MacPorts
- [MacPorts] #74122: py314-pikepdf @10.8.0: /bin/sh: CMAKE_CXX_COMPILER_CLANG_SCAN_DEPS-NOTFOUND: command not found
MacPorts
- [MacPorts] #74122: py314-pikepdf @10.8.0: /bin/sh: CMAKE_CXX_COMPILER_CLANG_SCAN_DEPS-NOTFOUND: command not found
MacPorts
- [MacPorts] #74131: we are facing issue will running the program
MacPorts
- [MacPorts] #74129: arti 2.4.0: Provide launchd facilities for arti
MacPorts
- [MacPorts] #74078: libheif @1.23.0: error: no member named 'ranges' in namespace 'std'
MacPorts
- [MacPorts] #74132: arm-none-eabi-gcc @16.1.0: Requires too much disk space to build
MacPorts
- [MacPorts] #74078: libheif @1.23.0: error: no member named 'ranges' in namespace 'std'
MacPorts
- [MacPorts] #74078: libheif @1.23.0: error: no member named 'ranges' in namespace 'std'
MacPorts
- [MacPorts] #74123: portfile.7: :Usage: .Ic interactive_command ... (#1313)
MacPorts
- [MacPorts] #74078: libheif @1.23.0: error: no member named 'ranges' in namespace 'std'
MacPorts
- [MacPorts] #74078: libheif @1.23.0: error: no member named 'ranges' in namespace 'std'
MacPorts
- [MacPorts] #74078: libheif @1.23.0: error: no member named 'ranges' in namespace 'std'
MacPorts
- [MacPorts] #74078: libheif @1.23.0: error: no member named 'ranges' in namespace 'std'
MacPorts
- [MacPorts] #74116: Error: Failed to build source-highlight: command execution failed
MacPorts
- [MacPorts] #74116: Error: Failed to build source-highlight: command execution failed
MacPorts
- [MacPorts] #74078: libheif @1.23.0: error: no member named 'ranges' in namespace 'std'
MacPorts
- [MacPorts] #74078: libheif @1.23.0: error: no member named 'ranges' in namespace 'std'
MacPorts
- [MacPorts] #74067: fftw-3 dependency on "openmpi-clang22" not found
MacPorts
- [MacPorts] #74133: source-highlight @3.1.9: error: ISO C++17 does not allow dynamic exception specifications [-Wdynamic-exception-spec]
MacPorts
- [MacPorts] #74133: source-highlight @3.1.9: error: ISO C++17 does not allow dynamic exception specifications [-Wdynamic-exception-spec]
MacPorts
- [MacPorts] #74116: source-highlight @3.1.9: Undefined boost symbols (was: Error: Failed to build source-highlight: command execution failed)
MacPorts
- [MacPorts] #74132: arm-none-eabi-gcc @16.1.0: Requires too much disk space to build
MacPorts
- [MacPorts] #72583: emacs-app @30.1_1+nativecomp+rsvg+treesitter launches multiple bash processes that do not terminate
MacPorts
- [MacPorts] #74134: octave fails destroot
MacPorts
- [MacPorts] #74134: octave fails destroot
MacPorts
- [MacPorts] #74134: octave fails destroot
MacPorts
- [MacPorts] #74130: py310-matplotlib: pin to latest supported version
MacPorts
- [MacPorts] #74078: libheif @1.23.0: error: no member named 'ranges' in namespace 'std'
MacPorts
- [MacPorts] #74078: libheif @1.23.0: error: no member named 'ranges' in namespace 'std'
MacPorts
- [MacPorts] #74135: sox at 14.4.2: redirect port to current development repository with version 14.8.0
MacPorts
- [MacPorts] #74135: sox at 14.4.2: redirect port to current development repository with version 14.8.0
MacPorts
- [MacPorts] #74136: ImageMagick @6.9.13-50_0+openexr+x11: Convert delay on loading type-ghostscript.xml
MacPorts
- [MacPorts] #74136: ImageMagick @6.9.13-50_0+openexr+x11: Convert delay on loading type-ghostscript.xml
MacPorts
- [MacPorts] #73167: libgcc15 can't find "md-unwind-def.h" (10.5.8)
MacPorts
- [MacPorts] #74137: Macports considers samba4 installation broken no matter what
MacPorts
- [MacPorts] #74137: Macports considers samba4 installation broken no matter what
MacPorts
- [MacPorts] #74138: metis @20260610+openmp: GKLib Linking Errors During Build
MacPorts
- [MacPorts] #74138: metis @20260610+openmp: GKLib Linking Errors During Build
MacPorts
- [MacPorts] #74137: Macports considers samba4 installation broken no matter what
MacPorts
- [MacPorts] #74138: metis @20260610+openmp: GKLib Linking Errors During Build
MacPorts
- [MacPorts] #74137: samba4: Port samba4 is still broken after rebuilding it more than 3 times. (was: Macports considers samba4 installation broken no matter what)
MacPorts
- [MacPorts] #74136: ImageMagick @6.9.13-50_0+openexr+x11: Convert delay on loading type-ghostscript.xml
MacPorts
- [MacPorts] #74134: octave @11.3.0: fails destroot: liboctave.dylib: File exists (was: octave fails destroot)
MacPorts
- [MacPorts] #73696: poppler @26.02.0_0: Undefined symbols __ZN5GpgME4Data8toStringB5cxx11Ev __ZNK5GpgME5Error11asStdStringB5cxx11Ev
MacPorts
- [MacPorts] #74137: samba4: Port samba4 is still broken after rebuilding it more than 3 times.
MacPorts
- [MacPorts] #74134: octave @11.3.0: fails destroot: liboctave.dylib: File exists
MacPorts
- [MacPorts] #74126: port -d selfupdate fail with MacPorts 2.10.5 & Big Sur 11.7.8
MacPorts
- [MacPorts] #74138: metis @20260610+openmp: GKLib Linking Errors During Build
MacPorts
- [MacPorts] #74138: metis @20260610+openmp: GKLib Linking Errors During Build
MacPorts
- [MacPorts] #74078: libheif @1.23.0: error: no member named 'ranges' in namespace 'std'
MacPorts
- [MacPorts] #74078: libheif @1.23.0: error: no member named 'ranges' in namespace 'std'
MacPorts
- [MacPorts] #74137: samba4: Port samba4 is still broken after rebuilding it more than 3 times.
MacPorts
- [MacPorts] #74137: samba4: Port samba4 is still broken after rebuilding it more than 3 times.
MacPorts
- [MacPorts] #74137: samba4: Port samba4 is still broken after rebuilding it more than 3 times.
MacPorts
- [MacPorts] #74139: wgshadertoy: setting build.env in post-extract isn't reliable
MacPorts
- [MacPorts] #74140: ihaskell: setting destroot.keepdirs in post-extract isn't reliable
MacPorts
- [MacPorts] #73639: ccache @4.13.1_0+doc: no member named 'ranges' in namespace 'std'
MacPorts
- [MacPorts] #74141: MacVim on 10.13 High Sierra
MacPorts
- [MacPorts] #74141: MacVim on 10.13 High Sierra
MacPorts
- [MacPorts] #74142: MYSQL8 Build not working on OSX 10.14
MacPorts
- [MacPorts] #74136: ImageMagick @6.9.13-50_0+openexr+x11: Convert delay on loading type-ghostscript.xml
MacPorts
- [MacPorts] #74142: MYSQL8 Build not working on OSX 10.14
MacPorts
- [MacPorts] #74143: godot @4.7: ERROR: Detected Apple Clang version older than 16, supported versions are Apple Clang 16 (Xcode 16) and later.
MacPorts
- [MacPorts] #74144: Test ticket under Anubis
MacPorts
- [MacPorts] #74144: Test ticket under Anubis
MacPorts
- [MacPorts] #74144: Test ticket under Anubis
MacPorts
- [MacPorts] #74137: samba4: Port samba4 is still broken after rebuilding it more than 3 times.
MacPorts
- [MacPorts] #74137: samba4: Port samba4 is still broken after rebuilding it more than 3 times.
MacPorts
- [MacPorts] #73097: py313-numpy @2.3.3: ERROR: Problem encountered: Function `sin` not found
MacPorts
- [MacPorts] #74136: ImageMagick @6.9.13-50_0+openexr+x11: Convert delay on loading type-ghostscript.xml
MacPorts
- [MacPorts] #74136: ImageMagick @6.9.13-50_0+openexr+x11: Convert delay on loading type-ghostscript.xml
MacPorts
- [MacPorts] #74136: ImageMagick @6.9.13-50_0+openexr+x11: Convert delay on loading type-ghostscript.xml
MacPorts
- [MacPorts] #74136: ImageMagick @6.9.13-50_0+openexr+x11: Convert delay on loading type-ghostscript.xml
MacPorts
- [MacPorts] #74095: ffmpeg8 @8.1_1 missing `--enable-libharfbuzz` flag breaks drawtext filter
MacPorts
- [MacPorts] #74141: MacVim on 10.13 High Sierra
MacPorts
- [MacPorts] #74145: libarchive 3.8.8 does not build with Apple gcc, failing with ICE on {standard input}:918:non-relocatable subtraction expression, "L___stack_chk_guard$non_lazy_ptr" minus "L00000000012$pb"
MacPorts
- [MacPorts] #68540: org-mode @9.4: org-agenda.elc: No such file or directory
MacPorts
- [MacPorts] #63004: emacs-app-devel @20210430_1+nativecomp+rsvg does not work on mac OS High Sierra, 10.13.6
MacPorts
- [MacPorts] #73660: Ports abandoned by michaelld
MacPorts
- [MacPorts] #66472: texlive-bin @2022.62882_2 produces an ld warning while building HINT/hitex
MacPorts
- [MacPorts] #73639: ccache @4.13.1_0+doc: no member named 'ranges' in namespace 'std'
MacPorts
- [MacPorts] #74135: sox at 14.4.2: redirect port to current development repository with version 14.8.0
MacPorts
- [MacPorts] #74146: yash @2.58.1: update to 2.61
MacPorts
- [MacPorts] #74146: yash @2.58.1: update to 2.61
MacPorts
- [MacPorts] #74146: yash @2.58.1: update to 2.61
MacPorts
- [MacPorts] #73639: ccache @4.13.1_0+doc: no member named 'ranges' in namespace 'std'
MacPorts
- [MacPorts] #74147: ssh-askpass: Improve description
MacPorts
- [MacPorts] #64033: gdcm @3.0.5_2: build fails on macOS 12 arm64
MacPorts
- [MacPorts] #73983: Recent vim update suffers from: "causes 'pp' to be shown on 1st line of file edited with vim"
MacPorts
- [MacPorts] #74148: dav2d: New port request
MacPorts
- [MacPorts] #73940: ncurses @6.6 does not build if `gawk` port is activated
MacPorts
- [MacPorts] #74136: ImageMagick @6.9.13-50_0+openexr+x11: Convert delay on loading type-ghostscript.xml
MacPorts
- [MacPorts] #74136: ImageMagick @6.9.13-50_0+openexr+x11: Convert delay on loading type-ghostscript.xml
MacPorts
- [MacPorts] #74136: ImageMagick @6.9.13-50_0+openexr+x11: Convert delay on loading type-ghostscript.xml
MacPorts
- [MacPorts] #74136: ImageMagick @6.9.13-50_0+openexr+x11: Convert delay on loading type-ghostscript.xml
MacPorts
- [MacPorts] #74136: ImageMagick @6.9.13-50_0+openexr+x11: Convert delay on loading type-ghostscript.xml
MacPorts
- [MacPorts] #74149: py-matplotlib @3.11.0: Tries and fails to download harfbuzz
MacPorts
- [MacPorts] #73940: ncurses @6.6 does not build if `gawk` port is activated
MacPorts
- [MacPorts] #74150: (10.6)(Mpv-legacy) (vo/gpu/opengl) GLX not found
MacPorts
- [MacPorts] #64671: dia: crashes on Apple Silicon
MacPorts
- [MacPorts] #73318: dia: Update to current 2025 upstream repo
MacPorts
- [MacPorts] #70898: dia @0.97.3: error: incompatible function pointer types initializing 'FT_Outline_MoveToFunc' (aka 'int (*)(const struct FT_Vector_ *, void *)') with an expression of type 'int (FT_Vector *, void *)' (aka 'int (struct FT_Vector_ *, void *)')
MacPorts
- [MacPorts] #73688: dia @0.97.3: error: incompatible function pointer types initializing 'FT_Outline_MoveToFunc'
MacPorts
- [MacPorts] #74151: py-Pillow: build fails on macOS 26 due to orphaned -C flag when using +x11 variant
MacPorts
- [MacPorts] #73318: dia: Update to current 2025 upstream repo
MacPorts
- [MacPorts] #73318: dia: Update to current 2025 upstream repo
MacPorts
- [MacPorts] #74150: mpv-legacy: (vo/gpu/opengl) GLX not found (was: (10.6)(Mpv-legacy) (vo/gpu/opengl) GLX not found)
MacPorts
- [MacPorts] #74151: py-Pillow: build fails on macOS 26 due to orphaned -C flag when using +x11 variant
MacPorts
- [MacPorts] #73940: ncurses @6.6 does not build if `gawk` port is activated
MacPorts
- [MacPorts] #73940: ncurses @6.6 does not build if `gawk` port is activated
MacPorts
- [MacPorts] #73940: ncurses @6.6 does not build if `gawk` port is activated
MacPorts
- [MacPorts] #74152: expat @2.8.1_0+universal caused python314 compile failure
MacPorts
- [MacPorts] #74152: expat @2.8.1_0+universal caused python314 compile failure
MacPorts
- [MacPorts] #74152: expat @2.8.1_0+universal caused python314 compile failure
MacPorts
- [MacPorts] #74152: expat @2.8.1_0+universal caused python314 compile failure
MacPorts
- [MacPorts] #73796: muniversal portgroup: Text file merging is broken on Tahoe
MacPorts
- [MacPorts] #73940: ncurses @6.6 does not build if `gawk` port is activated
MacPorts
- [MacPorts] #74153: Nethack 3.6.7 does not recognize X11 with +x11 variant
MacPorts
- [MacPorts] #74154: Failled to install port install php56-curl
MacPorts
- [MacPorts] #74154: Failled to install port install php56-curl
MacPorts
- [MacPorts] #74154: php56: Build failure (was: Failled to install port install php56-curl)
MacPorts
- [MacPorts] #74154: php56: Build failure
MacPorts
- [MacPorts] #74154: php56: Build failure
MacPorts
- [MacPorts] #74154: php56: Build failure
MacPorts
- [MacPorts] #74154: php56: Build failure
MacPorts
- [MacPorts] #74150: mpv-legacy: (vo/gpu/opengl) GLX not found
MacPorts
- [MacPorts] #74154: php56: Build failure
MacPorts
- [MacPorts] #74155: caddy 2.11.4: checksum mismatches
MacPorts
- [MacPorts] #74155: caddy 2.11.4: checksum mismatches
MacPorts
- [MacPorts] #74155: caddy @2.11.4: checksum mismatches (was: caddy 2.11.4: checksum mismatches)
MacPorts
- [MacPorts] #69995: gnubg: Fix homepage and update to 1.08.003
MacPorts
- [MacPorts] #42590: gnubg @0.14.3_5: build error "assignment to cast is illegal, lvalue casts are not supported"
MacPorts
- [MacPorts] #74154: php56: Build failure
MacPorts
- [MacPorts] #74154: php56: Build failure
MacPorts
- [MacPorts] #74154: php56: Build failure
MacPorts
- [MacPorts] #66046: xboard fails to open
MacPorts
- [MacPorts] #74156: [Port Abandoned] gnubg
MacPorts
- [MacPorts] #74157: Outset: Port request
MacPorts
- [MacPorts] #74158: Port is too silly to understand that variant ld64-97 +llvm34 is equivalent to default ld64-97 (+llvm33) and tries to build llvm33 although ld64-97 +llvm34 is installed and not activated
MacPorts
- [MacPorts] #73983: Recent vim update suffers from: "causes 'pp' to be shown on 1st line of file edited with vim"
MacPorts
- [MacPorts] #73983: Recent vim update suffers from: "causes 'pp' to be shown on 1st line of file edited with vim"
MacPorts
- [MacPorts] #74141: MacVim on 10.13 High Sierra
MacPorts
- [MacPorts] #74159: R-app @1.82_2 fails rev-upgrade check then fails to rebuild
MacPorts
- [MacPorts] #74159: R-app @1.82_2 fails rev-upgrade check then fails to rebuild
MacPorts
- [MacPorts] #74159: R-app @1.82_2 fails rev-upgrade check then fails to rebuild
MacPorts
- [MacPorts] #74159: R-app @1.82_2 fails rev-upgrade check then fails to rebuild
MacPorts
- [MacPorts] #74159: R-app @1.82_2 fails rev-upgrade check then fails to rebuild
MacPorts
- [MacPorts] #74159: R-app @1.82_2 fails rev-upgrade check then fails to rebuild
MacPorts
- [MacPorts] #74159: R-app @1.82_2 fails rev-upgrade check then fails to rebuild
MacPorts
- [MacPorts] #74159: R-app @1.82_2 fails rev-upgrade check then fails to rebuild
MacPorts
- [MacPorts] #74159: R-app @1.82_2 fails rev-upgrade check then fails to rebuild
MacPorts
- [MacPorts] #74159: R-app @1.82_2 fails rev-upgrade check then fails to rebuild
MacPorts
- [MacPorts] #74159: R-app @1.82_2 fails rev-upgrade check then fails to rebuild
MacPorts
- [MacPorts] #74013: mas: mas port lacks man page and wrapper shell script
MacPorts
- [MacPorts] #74160: rsync: update to 3.4.4
MacPorts
- [MacPorts] #74161: poppler -- Fails to Link -- Undefined symbols for architecture x86_64
MacPorts
- [MacPorts] #74161: poppler -- Fails to Link -- Undefined symbols for architecture x86_64
MacPorts
- [MacPorts] #74161: poppler -- Fails to Link -- Undefined symbols for architecture x86_64
MacPorts
- [MacPorts] #74162: py-bqscales: ValueError: Please install Node.js and npm before continuing installation.
MacPorts
- [MacPorts] #74162: py-bqscales: ValueError: Please install Node.js and npm before continuing installation.
MacPorts
- [MacPorts] #74162: py-bqscales: ValueError: Please install Node.js and npm before continuing installation.
MacPorts
- [MacPorts] #74163: noisy-delete.tcl: error deleting .ccache: file already exists
MacPorts
- [MacPorts] #74164: py313-matplotlib fails to build on Tahow 26.5.1
MacPorts
- [MacPorts] #74164: py313-matplotlib fails to build on Tahow 26.5.1
MacPorts
- [MacPorts] #74164: py313-matplotlib fails to build on Tahow 26.5.1
MacPorts
- [MacPorts] #74165: fish: no man pages
MacPorts
- [MacPorts] #74166: Processing of port libetonyek failed
MacPorts
- [MacPorts] #74164: py313-matplotlib fails to build on Tahoe 26.5.1 (was: py313-matplotlib fails to build on Tahow 26.5.1)
MacPorts
- [MacPorts] #74166: libetonyek: configure failed (was: Processing of port libetonyek failed)
MacPorts
- [MacPorts] #74164: py313-matplotlib fails to build on Tahoe 26.5.1
MacPorts
- [MacPorts] #74149: py-matplotlib @3.11.0: Tries and fails to download harfbuzz
MacPorts
- [MacPorts] #74167: Cannot upgrade starship to 1.26.0 due to Xcode missing
MacPorts
- [MacPorts] #74168: ollama @0.30.11: ERROR: MLX-C headers not found at: ../../mlxrunner/mlx/include/mlx/c
MacPorts
- [MacPorts] #74167: starship: Requires Xcode (was: Cannot upgrade starship to 1.26.0 due to Xcode missing)
MacPorts
- [MacPorts] #74166: libetonyek: configure failed
MacPorts
- [MacPorts] #71554: libetonyek: update to 0.1.13 (was: libetonyek: update to 0.1.12)
MacPorts
- [MacPorts] #66046: xboard: Unable to create font set for (was: xboard fails to open)
MacPorts
- [MacPorts] #74167: starship: Requires Xcode
MacPorts
- [MacPorts] #74167: starship: Requires Xcode
MacPorts
- [MacPorts] #74167: starship: Requires Xcode
MacPorts
- [MacPorts] #74168: ollama @0.30.11: ERROR: MLX-C headers not found at: ../../mlxrunner/mlx/include/mlx/c
MacPorts
- [MacPorts] #74167: starship: Requires Xcode
MacPorts
- [MacPorts] #67491: py-matplotlib fails to build with gcc: cc1obj: error: '-Werror=unguarded-availability': no option '-Wunguarded-availability'
MacPorts
- [MacPorts] #74156: [Port Abandoned] gnubg
MacPorts
- [MacPorts] #74156: [Port Abandoned] gnubg
MacPorts
- [MacPorts] #74164: py313-matplotlib fails to build on Tahoe 26.5.1
MacPorts
- [MacPorts] #74164: py313-matplotlib fails to build on Tahoe 26.5.1
MacPorts
- [MacPorts] #74164: py313-matplotlib fails to build on Tahoe 26.5.1
MacPorts
- [MacPorts] #74164: py313-matplotlib fails to build on Tahoe 26.5.1
MacPorts
- [MacPorts] #74164: py313-matplotlib fails to build on Tahoe 26.5.1
MacPorts
- [MacPorts] #74169: expat: corrupted expat_config.h in +universal binary archive (ar archive instead of C header)
MacPorts
- [MacPorts] #74169: expat: corrupted expat_config.h in +universal binary archive (ar archive instead of C header)
MacPorts
- [MacPorts] #74169: expat: corrupted expat_config.h in +universal binary archive (ar archive instead of C header)
MacPorts
Last message date:
Tue Jun 30 20:01:41 UTC 2026
Archived on: Tue Jun 30 20:01:47 UTC 2026
This archive was generated by
Pipermail 0.09 (Mailman edition).