[MacPorts] #74020: alliance fails to build: ./elp_y.y: error: parameter name omitted

MacPorts noreply at macports.org
Thu May 21 19:07:31 UTC 2026


#74020: alliance fails to build: ./elp_y.y: error: parameter name omitted
--------------------------+----------------------
 Reporter:  barracuda156  |      Owner:  (none)
     Type:  defect        |     Status:  new
 Priority:  Normal        |  Milestone:
Component:  ports         |    Version:  2.12.5
 Keywords:                |       Port:  alliance
--------------------------+----------------------
 {{{
  /usr/bin/gcc-4.2 -DPACKAGE_NAME=\"\" -DPACKAGE_TARNAME=\"\"
 -DPACKAGE_VERSION=\"\" -DPACKAGE_STRING=\"\" -DPACKAGE_BUGREPORT=\"\"
 -DPACKAGE=\"alliance\" -DVERSION=\"5.0\" -DYYTEXT_POINTER=1
 -DSTDC_HEADERS=1 -DHAVE_SYS_TYPES_H=1 -DHAVE_SYS_STAT_H=1
 -DHAVE_STDLIB_H=1 -DHAVE_STRING_H=1 -DHAVE_MEMORY_H=1 -DHAVE_STRINGS_H=1
 -DHAVE_INTTYPES_H=1 -DHAVE_STDINT_H=1 -DHAVE_UNISTD_H=1 -DHAVE_DLFCN_H=1
 -DHAVE_FCNTL_H=1 -DHAVE_STRINGS_H=1 -DHAVE_SYS_TIME_H=1 -DHAVE_UNISTD_H=1
 -DHAVE_STRINGS_H=1 -DHAVE_UNISTD_H=1 -DHAVE_LIBM=1 -DHAVE_LIBM=1
 -DHAVE_LIBM=1 -DHAVE_LIBM=1 -DHAVE_UNISTD_H=1 -DHAVE_FORK=1 -DHAVE_VFORK=1
 -DHAVE_WORKING_VFORK=1 -DHAVE_WORKING_FORK=1 -DSTDC_HEADERS=1
 -DHAVE_SYS_WAIT_H=1 -DRETSIGTYPE=void -DHAVE_MOTIF=1 -DHAVE_XPM=1
 -DHAVE_XPM=1 -DHAVE_X11_XPM_H=1 -DHAVE_MOTIF=1 -DHAVE_XMUSEVERSION=1
 -DHAVE_XMINSTALLIMAGE=1 "-DALLIANCE_VERSION=\"5.0 20110203\""
 -DALLIANCE_TOP=\"/opt/local\" -I. -I. -I/opt/local/include -I../../mbk/src
 -I../../rds/src -pipe -Os -std=c99 -arch ppc -MT gds_swap.lo -MD -MP -MF
 .deps/gds_swap.Tpo -c gds_swap.c -o gds_swap.o >/dev/null 2>&1
 /bin/sh ../../libtool --tag=CC --mode=link /usr/bin/gcc-4.2
 -I../../mbk/src -I../../rds/src -pipe -Os -std=c99 -arch ppc  -static
 -L/opt/local/lib -Wl,-headerpad_max_install_names -arch ppc -o libRgs.la
 -rpath /opt/local/lib -version-info 2:1:0 gds_parse.lo gds_error.lo
 gds_drive.lo gds_swap.lo  -lm -lm -lm -lm
 ar cru .libs/libRgs.a  gds_parse.o gds_error.o gds_drive.o gds_swap.o
 ranlib .libs/libRgs.a
 creating libRgs.la
 (cd .libs && rm -f libRgs.la && ln -s ../libRgs.la libRgs.la)
 make[2]: Leaving directory `/opt/local/var/macports/build/alliance-
 d1ccd4c5/work/alliance-5.0/rdsgds/src'
 make[2]: Entering directory `/opt/local/var/macports/build/alliance-
 d1ccd4c5/work/alliance-5.0/rdsgds'
 make[2]: Nothing to be done for `all-am'.
 make[2]: Leaving directory `/opt/local/var/macports/build/alliance-
 d1ccd4c5/work/alliance-5.0/rdsgds'
 make[1]: Leaving directory `/opt/local/var/macports/build/alliance-
 d1ccd4c5/work/alliance-5.0/rdsgds'
 Making all in elp
 make[1]: Entering directory `/opt/local/var/macports/build/alliance-
 d1ccd4c5/work/alliance-5.0/elp'
 Making all in src
 make[2]: Entering directory `/opt/local/var/macports/build/alliance-
 d1ccd4c5/work/alliance-5.0/elp/src'
 bison -y -d  ./elp_y.y && sed -e "s/yy/elpyy/g" -e "s/YY/elpYY/g" y.tab.c
 > elp_y.c && sed -e "s/yy/elpyy/g" -e "s/YY/elpYY/g" y.tab.h > elp_y.h
 if /bin/sh ../../libtool --tag=CC --mode=compile /usr/bin/gcc-4.2
 -DPACKAGE_NAME=\"\" -DPACKAGE_TARNAME=\"\" -DPACKAGE_VERSION=\"\"
 -DPACKAGE_STRING=\"\" -DPACKAGE_BUGREPORT=\"\" -DPACKAGE=\"alliance\"
 -DVERSION=\"5.0\" -DYYTEXT_POINTER=1 -DSTDC_HEADERS=1 -DHAVE_SYS_TYPES_H=1
 -DHAVE_SYS_STAT_H=1 -DHAVE_STDLIB_H=1 -DHAVE_STRING_H=1 -DHAVE_MEMORY_H=1
 -DHAVE_STRINGS_H=1 -DHAVE_INTTYPES_H=1 -DHAVE_STDINT_H=1 -DHAVE_UNISTD_H=1
 -DHAVE_DLFCN_H=1 -DHAVE_FCNTL_H=1 -DHAVE_STRINGS_H=1 -DHAVE_SYS_TIME_H=1
 -DHAVE_UNISTD_H=1 -DHAVE_STRINGS_H=1 -DHAVE_UNISTD_H=1 -DHAVE_LIBM=1
 -DHAVE_LIBM=1 -DHAVE_LIBM=1 -DHAVE_LIBM=1 -DHAVE_UNISTD_H=1 -DHAVE_FORK=1
 -DHAVE_VFORK=1 -DHAVE_WORKING_VFORK=1 -DHAVE_WORKING_FORK=1
 -DSTDC_HEADERS=1 -DHAVE_SYS_WAIT_H=1 -DRETSIGTYPE=void -DHAVE_MOTIF=1
 -DHAVE_XPM=1 -DHAVE_XPM=1 -DHAVE_X11_XPM_H=1 -DHAVE_MOTIF=1
 -DHAVE_XMUSEVERSION=1 -DHAVE_XMINSTALLIMAGE=1 -DALLIANCE_VERSION=\"5.0\
 20110203\" -DALLIANCE_TOP=\"/opt/local\"  -I. -I.   -I/opt/local/include
 -DTECHNOLOGY=\"etc/prol.elp\" -I../../mbk/src -pipe -Os -std=c99 -arch ppc
 -MT elp_y.lo -MD -MP -MF ".deps/elp_y.Tpo" -c -o elp_y.lo elp_y.c; \
         then mv -f ".deps/elp_y.Tpo" ".deps/elp_y.Plo"; else rm -f
 ".deps/elp_y.Tpo"; exit 1; fi
 mkdir .libs
  /usr/bin/gcc-4.2 -DPACKAGE_NAME=\"\" -DPACKAGE_TARNAME=\"\"
 -DPACKAGE_VERSION=\"\" -DPACKAGE_STRING=\"\" -DPACKAGE_BUGREPORT=\"\"
 -DPACKAGE=\"alliance\" -DVERSION=\"5.0\" -DYYTEXT_POINTER=1
 -DSTDC_HEADERS=1 -DHAVE_SYS_TYPES_H=1 -DHAVE_SYS_STAT_H=1
 -DHAVE_STDLIB_H=1 -DHAVE_STRING_H=1 -DHAVE_MEMORY_H=1 -DHAVE_STRINGS_H=1
 -DHAVE_INTTYPES_H=1 -DHAVE_STDINT_H=1 -DHAVE_UNISTD_H=1 -DHAVE_DLFCN_H=1
 -DHAVE_FCNTL_H=1 -DHAVE_STRINGS_H=1 -DHAVE_SYS_TIME_H=1 -DHAVE_UNISTD_H=1
 -DHAVE_STRINGS_H=1 -DHAVE_UNISTD_H=1 -DHAVE_LIBM=1 -DHAVE_LIBM=1
 -DHAVE_LIBM=1 -DHAVE_LIBM=1 -DHAVE_UNISTD_H=1 -DHAVE_FORK=1 -DHAVE_VFORK=1
 -DHAVE_WORKING_VFORK=1 -DHAVE_WORKING_FORK=1 -DSTDC_HEADERS=1
 -DHAVE_SYS_WAIT_H=1 -DRETSIGTYPE=void -DHAVE_MOTIF=1 -DHAVE_XPM=1
 -DHAVE_XPM=1 -DHAVE_X11_XPM_H=1 -DHAVE_MOTIF=1 -DHAVE_XMUSEVERSION=1
 -DHAVE_XMINSTALLIMAGE=1 "-DALLIANCE_VERSION=\"5.0 20110203\""
 -DALLIANCE_TOP=\"/opt/local\" -I. -I. -I/opt/local/include
 -DTECHNOLOGY=\"etc/prol.elp\" -I../../mbk/src -pipe -Os -std=c99 -arch ppc
 -MT elp_y.lo -MD -MP -MF .deps/elp_y.Tpo -c elp_y.c  -fno-common -DPIC -o
 .libs/elp_y.o
 ./elp_y.y: In function 'elpyyerror':
 ./elp_y.y:106: error: parameter name omitted
 make[2]: *** [elp_y.lo] Error 1
 make[2]: Leaving directory `/opt/local/var/macports/build/alliance-
 d1ccd4c5/work/alliance-5.0/elp/src'
 make[1]: *** [all-recursive] Error 1
 }}}

-- 
Ticket URL: <https://trac.macports.org/ticket/74020>
MacPorts <https://www.macports.org/>
Ports system for macOS


More information about the macports-tickets mailing list