[MacPorts] #73896: jdupes @1.31.1 does not build on macOS High Sierra, Version 10.13.6, because of: act_linkfiles.c:365:23: error: label at end of compound statement: expected statement

MacPorts noreply at macports.org
Tue May 26 02:47:23 UTC 2026


#73896: jdupes @1.31.1 does not build on macOS High Sierra, Version 10.13.6,
because of: act_linkfiles.c:365:23: error: label at end of compound
statement: expected statement
------------------------+------------------------
  Reporter:  ballapete  |      Owner:  (none)
      Type:  defect     |     Status:  new
  Priority:  Normal     |  Milestone:
 Component:  ports      |    Version:  2.12.5
Resolution:             |   Keywords:  highsierra
      Port:  jdupes     |
------------------------+------------------------

Comment (by bunk3m):

 Also not building on macos 12.7.6

 Different error as far as I can see.  I hope the log helps the maintainer.


 {{{
 version:1
 :debug:main Starting logging for jdupes @1.31.1_0
 :debug:sysinfo macOS 12.7.6 (darwin/21.6.0) arch i386
 :debug:sysinfo MacPorts 2.12.5
 :debug:sysinfo Xcode 14.2, CLT 14.2.0.0.1.1668646533
 :debug:sysinfo SDK 12
 :debug:sysinfo MACOSX_DEPLOYMENT_TARGET: 12.0
 :msg:main --->  Upgrading already installed dependencies of jdupes
 :debug:main epoch: in tree: 0 installed: 0
 :debug:main libjodycode 4.1.2_0 exists in the ports tree
 :debug:main libjodycode 4.1.2_0  is the latest installed
 :debug:main libjodycode 4.1.2_0  is active
 :debug:main Merging existing requested variants '' into variants
 :debug:main new fully merged portvariants: bash_completion +
 :debug:main Opening port in directory:
 /opt/local/var/macports/sources/rsync.macports.org/macports/release/tarballs/ports/devel/libjodycode
 :debug:main OS darwin/21.6.0 (macOS 12.7.6) arch i386
 :debug:main Sourcing PortGroup codeberg 1.0 from
 /opt/local/var/macports/sources/rsync.macports.org/macports/release/tarballs/ports/_resources/port1.0/group/codeberg-1.0.tcl
 :debug:main Sourcing PortGroup compiler_wrapper 1.0 from
 /opt/local/var/macports/sources/rsync.macports.org/macports/release/tarballs/ports/_resources/port1.0/group/compiler_wrapper-1.0.tcl
 :debug:main Re-registering default for compwrap.add_compiler_flags
 :debug:main Re-registering default for use_configure
 :debug:main Re-registering default for universal_variant
 :debug:main Sourcing PortGroup makefile 1.0 from
 /opt/local/var/macports/sources/rsync.macports.org/macports/release/tarballs/ports/_resources/port1.0/group/makefile-1.0.tcl
 :debug:main Re-registering default for extract.rename
 :debug:main Re-registering default for livecheck.url
 :debug:main Re-registering default for livecheck.regex
 :debug:main adding the default universal variant
 :debug:main Requested variant +bash_completion is not provided by port
 libjodycode.
 :debug:main Running callback portextract::add_extract_deps
 :debug:main Finished running callback portextract::add_extract_deps
 :debug:main Running callback
 portconfigure::add_automatic_compiler_dependencies
 :debug:main Finished running callback
 portconfigure::add_automatic_compiler_dependencies
 :debug:main Running callback
 portbuild::add_automatic_buildsystem_dependencies
 :debug:main Finished running callback
 portbuild::add_automatic_buildsystem_dependencies
 :debug:main Running callback portstartupitem::add_notes
 :debug:main Finished running callback portstartupitem::add_notes
 :debug:main Running callback compwrap::configure_envs
 :debug:main Finished running callback compwrap::configure_envs
 :debug:main Running callback makefile_pg::makefile_setup
 :debug:main Finished running callback makefile_pg::makefile_setup
 :debug:main No need to upgrade! libjodycode 4.1.2_0 >= libjodycode 4.1.2_0
 :msg:main --->  Computing dependencies for jdupes:info:main .:debug:main
 jdupes has no conflicts
 :debug:main Searching for dependency: libjodycode
 :debug:main Found Dependency: receipt exists for libjodycode
 :debug:main Executing org.macports.main (jdupes)
 :debug:main dropping privileges: euid changed to 502, egid changed to 501.
 :debug:main Privilege de-escalation not attempted as not running as root.
 :debug:archivefetch archivefetch phase started at
 2026-05-26T02:42:57.378+0000 (Mon May 25 22:42:57 EDT 2026)
 :msg:archivefetch --->  Fetching archive for jdupes
 :debug:archivefetch Executing org.macports.archivefetch (jdupes)
 :notice:archivefetch Attempting to fetch
 https://packages.macports.org/jdupes/jdupes-1.31.1_0.darwin_21.x86_64.tbz2
 :debug:archivefetch Fetching
 https://packages.macports.org/jdupes/jdupes-1.31.1_0.darwin_21.x86_64.tbz2
 failed: The requested URL returned error: 404
 :notice:archivefetch Attempting to fetch
 https://bos.us.packages.macports.org/jdupes/jdupes-1.31.1_0.darwin_21.x86_64.tbz2
 :debug:archivefetch Fetching
 https://bos.us.packages.macports.org/jdupes/jdupes-1.31.1_0.darwin_21.x86_64.tbz2
 failed: The requested URL returned error: 404
 :notice:archivefetch Attempting to fetch
 http://mirror.fcix.net/macports/packages/jdupes/jdupes-1.31.1_0.darwin_21.x86_64.tbz2
 :debug:archivefetch Fetching
 http://mirror.fcix.net/macports/packages/jdupes/jdupes-1.31.1_0.darwin_21.x86_64.tbz2
 failed: The requested URL returned error: 404
 :debug:archivefetch Privilege de-escalation not attempted as not running
 as root.
 :debug:fetch fetch phase started at 2026-05-26T02:42:57.845+0000 (Mon May
 25 22:42:57 EDT 2026)
 :notice:fetch --->  Archive not available for jdupes, building locally
 :notice:fetch --->  Fetching distfiles for jdupes
 :debug:fetch Executing org.macports.fetch (jdupes)
 :debug:fetch Privilege de-escalation not attempted as not running as root.
 :debug:checksum checksum phase started at 2026-05-26T02:42:57.869+0000
 (Mon May 25 22:42:57 EDT 2026)
 :notice:checksum --->  Verifying checksums for jdupes
 :debug:checksum Executing org.macports.checksum (jdupes)
 :info:checksum --->  Checksumming v1.31.1.tar.gz
 :debug:checksum Calculated (rmd160) is
 27db62fd7f888ab45cfabf34c5e58f34cbbbf8ca
 :debug:checksum Correct (rmd160) checksum for v1.31.1.tar.gz
 :debug:checksum Calculated (sha256) is
 c80d4c1deb03cc891a7e938f886952cfc480b8a0bc48baf21b312d350b62d8e3
 :debug:checksum Correct (sha256) checksum for v1.31.1.tar.gz
 :debug:checksum Calculated (size) is 178534
 :debug:checksum Correct (size) checksum for v1.31.1.tar.gz
 :debug:checksum Privilege de-escalation not attempted as not running as
 root.
 :debug:extract extract phase started at 2026-05-26T02:42:57.908+0000 (Mon
 May 25 22:42:57 EDT 2026)
 :notice:extract --->  Extracting jdupes
 :debug:extract Executing org.macports.extract (jdupes)
 :info:extract --->  Extracting v1.31.1.tar.gz
 :debug:extract setting option extract.args to
 '/opt/local/var/macports/distfiles/jdupes/v1.31.1.tar.gz'
 :debug:extract Environment:
 :debug:extract CC_PRINT_OPTIONS='YES'
 :debug:extract CC_PRINT_OPTIONS_FILE='/opt/local/var/macports/build
 /jdupes-4717e162/work/.CC_PRINT_OPTIONS'
 :debug:extract CPATH='/opt/local/include'
 :debug:extract DEVELOPER_DIR='/Library/Developer/CommandLineTools'
 :debug:extract LIBRARY_PATH='/opt/local/lib'
 :debug:extract MACOSX_DEPLOYMENT_TARGET='12.0'
 :debug:extract
 SDKROOT='/Library/Developer/CommandLineTools/SDKs/MacOSX12.sdk'
 :debug:extract SOURCE_DATE_EPOCH='1775996771'
 :info:extract Executing:  cd "/opt/local/var/macports/build/jdupes-
 4717e162/work" && /usr/bin/gzip -dc
 '/opt/local/var/macports/distfiles/jdupes/v1.31.1.tar.gz' | /usr/bin/tar
 -xf -
 :debug:extract system:  cd "/opt/local/var/macports/build/jdupes-
 4717e162/work" && /usr/bin/gzip -dc
 '/opt/local/var/macports/distfiles/jdupes/v1.31.1.tar.gz' | /usr/bin/tar
 -xf -
 :debug:extract euid/egid changed to: 0/0
 :debug:extract chowned /opt/local/var/macports/build/jdupes-4717e162/work
 to macports
 :debug:extract euid/egid changed to: 502/501
 :debug:extract extract.rename: Renaming jdupes -> v1.31.1
 :debug:extract Executing proc-post-org.macports.extract-extract-0
 :info:extract xinstall: mkdir /opt/local/var/macports/build/jdupes-
 4717e162/work/compwrap
 :info:extract xinstall: mkdir /opt/local/var/macports/build/jdupes-
 4717e162/work/compwrap/cc
 :info:extract xinstall: mkdir /opt/local/var/macports/build/jdupes-
 4717e162/work/compwrap/cc/usr
 :info:extract xinstall: mkdir /opt/local/var/macports/build/jdupes-
 4717e162/work/compwrap/cc/usr/bin
 :debug:extract compiler_wrapper: Creating /opt/local/var/macports/build
 /jdupes-4717e162/work/compwrap/cc/usr/bin/clang
 :debug:extract compiler_wrapper:  -> Will embed legacysupport flags in cc
 wrapper script
 :info:extract xinstall: mkdir /opt/local/var/macports/build/jdupes-
 4717e162/work/compwrap/objc
 :info:extract xinstall: mkdir /opt/local/var/macports/build/jdupes-
 4717e162/work/compwrap/objc/usr
 :info:extract xinstall: mkdir /opt/local/var/macports/build/jdupes-
 4717e162/work/compwrap/objc/usr/bin
 :debug:extract compiler_wrapper: Creating /opt/local/var/macports/build
 /jdupes-4717e162/work/compwrap/objc/usr/bin/clang
 :debug:extract compiler_wrapper:  -> Will embed legacysupport flags in
 objc wrapper script
 :info:extract xinstall: mkdir /opt/local/var/macports/build/jdupes-
 4717e162/work/compwrap/cxx
 :info:extract xinstall: mkdir /opt/local/var/macports/build/jdupes-
 4717e162/work/compwrap/cxx/usr
 :info:extract xinstall: mkdir /opt/local/var/macports/build/jdupes-
 4717e162/work/compwrap/cxx/usr/bin
 :debug:extract compiler_wrapper: Creating /opt/local/var/macports/build
 /jdupes-4717e162/work/compwrap/cxx/usr/bin/clang++
 :debug:extract compiler_wrapper:  -> Will embed legacysupport flags in cxx
 wrapper script
 :info:extract xinstall: mkdir /opt/local/var/macports/build/jdupes-
 4717e162/work/compwrap/objcxx
 :info:extract xinstall: mkdir /opt/local/var/macports/build/jdupes-
 4717e162/work/compwrap/objcxx/usr
 :info:extract xinstall: mkdir /opt/local/var/macports/build/jdupes-
 4717e162/work/compwrap/objcxx/usr/bin
 :debug:extract compiler_wrapper: Creating /opt/local/var/macports/build
 /jdupes-4717e162/work/compwrap/objcxx/usr/bin/clang++
 :debug:extract compiler_wrapper:  -> Will embed legacysupport flags in
 objcxx wrapper script
 :debug:extract Privilege de-escalation not attempted as not running as
 root.
 :debug:patch patch phase started at 2026-05-26T02:42:58.252+0000 (Mon May
 25 22:42:58 EDT 2026)
 :debug:patch Executing org.macports.patch (jdupes)
 :notice:patch --->  Applying patches to jdupes
 :info:patch --->  Applying filestat.patch
 :debug:patch Environment:
 :debug:patch CC_PRINT_OPTIONS='YES'
 :debug:patch CC_PRINT_OPTIONS_FILE='/opt/local/var/macports/build/jdupes-
 4717e162/work/.CC_PRINT_OPTIONS'
 :debug:patch CPATH='/opt/local/include'
 :debug:patch DEVELOPER_DIR='/Library/Developer/CommandLineTools'
 :debug:patch LIBRARY_PATH='/opt/local/lib'
 :debug:patch MACOSX_DEPLOYMENT_TARGET='12.0'
 :debug:patch
 SDKROOT='/Library/Developer/CommandLineTools/SDKs/MacOSX12.sdk'
 :debug:patch SOURCE_DATE_EPOCH='1775996771'
 :info:patch Executing:  cd "/opt/local/var/macports/build/jdupes-
 4717e162/work/v1.31.1" && /usr/bin/patch -t -N -p0 <
 '/opt/local/var/macports/sources/rsync.macports.org/macports/release/tarballs/ports/sysutils/jdupes/files/filestat.patch'
 :debug:patch system:  cd "/opt/local/var/macports/build/jdupes-
 4717e162/work/v1.31.1" && /usr/bin/patch -t -N -p0 <
 '/opt/local/var/macports/sources/rsync.macports.org/macports/release/tarballs/ports/sysutils/jdupes/files/filestat.patch'
 :info:patch patching file filestat.c
 :debug:patch Privilege de-escalation not attempted as not running as root.
 :debug:configure configure phase started at 2026-05-26T02:42:58.352+0000
 (Mon May 25 22:42:58 EDT 2026)
 :notice:configure --->  Configuring jdupes
 :debug:configure Preferred compilers: clang macports-clang-17 macports-
 clang-16 macports-clang-15 macports-clang-14 macports-clang-13 macports-
 clang-12 macports-clang-11 macports-clang-10 macports-clang-9.0
 :debug:configure Using compiler 'Xcode Clang'
 :debug:configure Executing org.macports.configure (jdupes)
 :debug:configure Executing portconfigure::configure_finish
 :debug:configure Privilege de-escalation not attempted as not running as
 root.
 :debug:build build phase started at 2026-05-26T02:42:58.400+0000 (Mon May
 25 22:42:58 EDT 2026)
 :notice:build --->  Building jdupes
 :debug:build Executing proc-pre-org.macports.build-build-0
 :debug:build Executing org.macports.build (jdupes)
 :debug:build Environment:
 :debug:build CC='/opt/local/var/macports/build/jdupes-
 4717e162/work/compwrap/cc/usr/bin/clang'
 :debug:build CC_PRINT_OPTIONS='YES'
 :debug:build CC_PRINT_OPTIONS_FILE='/opt/local/var/macports/build/jdupes-
 4717e162/work/.CC_PRINT_OPTIONS'
 :debug:build CFLAGS='-Os
 -isysroot/Library/Developer/CommandLineTools/SDKs/MacOSX12.sdk -arch
 x86_64'
 :debug:build CPATH='/opt/local/include'
 :debug:build CPPFLAGS='-I/opt/local/include
 -isysroot/Library/Developer/CommandLineTools/SDKs/MacOSX12.sdk'
 :debug:build CXX='/opt/local/var/macports/build/jdupes-
 4717e162/work/compwrap/cxx/usr/bin/clang++'
 :debug:build CXXFLAGS='-Os
 -isysroot/Library/Developer/CommandLineTools/SDKs/MacOSX12.sdk -arch
 x86_64 -stdlib=libc++'
 :debug:build DEVELOPER_DIR='/Library/Developer/CommandLineTools'
 :debug:build F90FLAGS='-Os -m64'
 :debug:build FCFLAGS='-Os -m64'
 :debug:build FFLAGS='-Os -m64'
 :debug:build INSTALL='/opt/local/libexec/macports/clonebin/install'
 :debug:build LDFLAGS='-L/opt/local/lib -Wl,-headerpad_max_install_names
 -Wl,-syslibroot,/Library/Developer/CommandLineTools/SDKs/MacOSX12.sdk
 -arch x86_64'
 :debug:build LIBRARY_PATH='/opt/local/lib'
 :debug:build MACOSX_DEPLOYMENT_TARGET='12.0'
 :debug:build OBJC='/opt/local/var/macports/build/jdupes-
 4717e162/work/compwrap/objc/usr/bin/clang'
 :debug:build OBJCFLAGS='-Os
 -isysroot/Library/Developer/CommandLineTools/SDKs/MacOSX12.sdk -arch
 x86_64'
 :debug:build OBJCXX='/opt/local/var/macports/build/jdupes-
 4717e162/work/compwrap/objcxx/usr/bin/clang++'
 :debug:build OBJCXXFLAGS='-Os
 -isysroot/Library/Developer/CommandLineTools/SDKs/MacOSX12.sdk
 -isysroot/Library/Developer/CommandLineTools/SDKs/MacOSX12.sdk -arch
 x86_64 -stdlib=libc++'
 :debug:build PREFIX='/opt/local'
 :debug:build
 SDKROOT='/Library/Developer/CommandLineTools/SDKs/MacOSX12.sdk'
 :debug:build SOURCE_DATE_EPOCH='1775996771'
 :info:build Executing:  cd "/opt/local/var/macports/build/jdupes-
 4717e162/work/v1.31.1" && /usr/bin/make -j8 -w all ENABLE_DEDUPE=1
 PREFIX=/opt/local CC="/opt/local/var/macports/build/jdupes-
 4717e162/work/compwrap/cc/usr/bin/clang"
 CXX="/opt/local/var/macports/build/jdupes-
 4717e162/work/compwrap/cxx/usr/bin/clang++"
 OBJC="/opt/local/var/macports/build/jdupes-
 4717e162/work/compwrap/objc/usr/bin/clang"
 OBJCXX="/opt/local/var/macports/build/jdupes-
 4717e162/work/compwrap/objcxx/usr/bin/clang++"
 INSTALL="/opt/local/libexec/macports/clonebin/install"
 :debug:build system:  cd "/opt/local/var/macports/build/jdupes-
 4717e162/work/v1.31.1" && /usr/bin/make -j8 -w all ENABLE_DEDUPE=1
 PREFIX=/opt/local CC="/opt/local/var/macports/build/jdupes-
 4717e162/work/compwrap/cc/usr/bin/clang"
 CXX="/opt/local/var/macports/build/jdupes-
 4717e162/work/compwrap/cxx/usr/bin/clang++"
 OBJC="/opt/local/var/macports/build/jdupes-
 4717e162/work/compwrap/objc/usr/bin/clang"
 OBJCXX="/opt/local/var/macports/build/jdupes-
 4717e162/work/compwrap/objcxx/usr/bin/clang++"
 INSTALL="/opt/local/libexec/macports/clonebin/install"
 :info:build hint: if ../libjodycode is built but jdupes won't run, try
 doing 'make static_jc'
 :info:build make: Entering directory `/opt/local/var/macports/build
 /jdupes-4717e162/work/v1.31.1'
 :info:build /opt/local/var/macports/build/jdupes-
 4717e162/work/compwrap/cc/usr/bin/clang -Os
 -isysroot/Library/Developer/CommandLineTools/SDKs/MacOSX12.sdk -arch
 x86_64 -Wall -Wwrite-strings -Wcast-align -Wstrict-aliasing -Wstrict-
 prototypes -Wpointer-arith -Wundef -Wshadow -Wfloat-equal -Waggregate-
 return -Wcast-qual -Wswitch-default -Wswitch-enum -Wunreachable-code
 -Wformat=2 -std=gnu11 -D_FILE_OFFSET_BITS=64 -fstrict-aliasing -pipe
 -DNO_ATIME -DNDEBUG -Wextra -Wstrict-overflow=5 -Winit-self
 -Wl,-stack_size -Wl,0x1000000 -DENABLE_DEDUPE  -I/opt/local/include
 -isysroot/Library/Developer/CommandLineTools/SDKs/MacOSX12.sdk  -c -o
 hashdb.o hashdb.c
 :info:build /opt/local/var/macports/build/jdupes-
 4717e162/work/compwrap/cc/usr/bin/clang -Os
 -isysroot/Library/Developer/CommandLineTools/SDKs/MacOSX12.sdk -arch
 x86_64 -Wall -Wwrite-strings -Wcast-align -Wstrict-aliasing -Wstrict-
 prototypes -Wpointer-arith -Wundef -Wshadow -Wfloat-equal -Waggregate-
 return -Wcast-qual -Wswitch-default -Wswitch-enum -Wunreachable-code
 -Wformat=2 -std=gnu11 -D_FILE_OFFSET_BITS=64 -fstrict-aliasing -pipe
 -DNO_ATIME -DNDEBUG -Wextra -Wstrict-overflow=5 -Winit-self
 -Wl,-stack_size -Wl,0x1000000 -DENABLE_DEDUPE  -I/opt/local/include
 -isysroot/Library/Developer/CommandLineTools/SDKs/MacOSX12.sdk  -c -o
 args.o args.c
 :info:build /opt/local/var/macports/build/jdupes-
 4717e162/work/compwrap/cc/usr/bin/clang -Os
 -isysroot/Library/Developer/CommandLineTools/SDKs/MacOSX12.sdk -arch
 x86_64 -Wall -Wwrite-strings -Wcast-align -Wstrict-aliasing -Wstrict-
 prototypes -Wpointer-arith -Wundef -Wshadow -Wfloat-equal -Waggregate-
 return -Wcast-qual -Wswitch-default -Wswitch-enum -Wunreachable-code
 -Wformat=2 -std=gnu11 -D_FILE_OFFSET_BITS=64 -fstrict-aliasing -pipe
 -DNO_ATIME -DNDEBUG -Wextra -Wstrict-overflow=5 -Winit-self
 -Wl,-stack_size -Wl,0x1000000 -DENABLE_DEDUPE  -I/opt/local/include
 -isysroot/Library/Developer/CommandLineTools/SDKs/MacOSX12.sdk  -c -o
 checks.o checks.c
 :info:build /opt/local/var/macports/build/jdupes-
 4717e162/work/compwrap/cc/usr/bin/clang -Os
 -isysroot/Library/Developer/CommandLineTools/SDKs/MacOSX12.sdk -arch
 x86_64 -Wall -Wwrite-strings -Wcast-align -Wstrict-aliasing -Wstrict-
 prototypes -Wpointer-arith -Wundef -Wshadow -Wfloat-equal -Waggregate-
 return -Wcast-qual -Wswitch-default -Wswitch-enum -Wunreachable-code
 -Wformat=2 -std=gnu11 -D_FILE_OFFSET_BITS=64 -fstrict-aliasing -pipe
 -DNO_ATIME -DNDEBUG -Wextra -Wstrict-overflow=5 -Winit-self
 -Wl,-stack_size -Wl,0x1000000 -DENABLE_DEDUPE  -I/opt/local/include
 -isysroot/Library/Developer/CommandLineTools/SDKs/MacOSX12.sdk  -c -o
 dumpflags.o dumpflags.c
 :info:build /opt/local/var/macports/build/jdupes-
 4717e162/work/compwrap/cc/usr/bin/clang -Os
 -isysroot/Library/Developer/CommandLineTools/SDKs/MacOSX12.sdk -arch
 x86_64 -Wall -Wwrite-strings -Wcast-align -Wstrict-aliasing -Wstrict-
 prototypes -Wpointer-arith -Wundef -Wshadow -Wfloat-equal -Waggregate-
 return -Wcast-qual -Wswitch-default -Wswitch-enum -Wunreachable-code
 -Wformat=2 -std=gnu11 -D_FILE_OFFSET_BITS=64 -fstrict-aliasing -pipe
 -DNO_ATIME -DNDEBUG -Wextra -Wstrict-overflow=5 -Winit-self
 -Wl,-stack_size -Wl,0x1000000 -DENABLE_DEDUPE  -I/opt/local/include
 -isysroot/Library/Developer/CommandLineTools/SDKs/MacOSX12.sdk  -c -o
 extfilter.o extfilter.c
 :info:build /opt/local/var/macports/build/jdupes-
 4717e162/work/compwrap/cc/usr/bin/clang -Os
 -isysroot/Library/Developer/CommandLineTools/SDKs/MacOSX12.sdk -arch
 x86_64 -Wall -Wwrite-strings -Wcast-align -Wstrict-aliasing -Wstrict-
 prototypes -Wpointer-arith -Wundef -Wshadow -Wfloat-equal -Waggregate-
 return -Wcast-qual -Wswitch-default -Wswitch-enum -Wunreachable-code
 -Wformat=2 -std=gnu11 -D_FILE_OFFSET_BITS=64 -fstrict-aliasing -pipe
 -DNO_ATIME -DNDEBUG -Wextra -Wstrict-overflow=5 -Winit-self
 -Wl,-stack_size -Wl,0x1000000 -DENABLE_DEDUPE  -I/opt/local/include
 -isysroot/Library/Developer/CommandLineTools/SDKs/MacOSX12.sdk  -c -o
 filehash.o filehash.c
 :info:build /opt/local/var/macports/build/jdupes-
 4717e162/work/compwrap/cc/usr/bin/clang -Os
 -isysroot/Library/Developer/CommandLineTools/SDKs/MacOSX12.sdk -arch
 x86_64 -Wall -Wwrite-strings -Wcast-align -Wstrict-aliasing -Wstrict-
 prototypes -Wpointer-arith -Wundef -Wshadow -Wfloat-equal -Waggregate-
 return -Wcast-qual -Wswitch-default -Wswitch-enum -Wunreachable-code
 -Wformat=2 -std=gnu11 -D_FILE_OFFSET_BITS=64 -fstrict-aliasing -pipe
 -DNO_ATIME -DNDEBUG -Wextra -Wstrict-overflow=5 -Winit-self
 -Wl,-stack_size -Wl,0x1000000 -DENABLE_DEDUPE  -I/opt/local/include
 -isysroot/Library/Developer/CommandLineTools/SDKs/MacOSX12.sdk  -c -o
 filestat.o filestat.c
 :info:build /opt/local/var/macports/build/jdupes-
 4717e162/work/compwrap/cc/usr/bin/clang -Os
 -isysroot/Library/Developer/CommandLineTools/SDKs/MacOSX12.sdk -arch
 x86_64 -Wall -Wwrite-strings -Wcast-align -Wstrict-aliasing -Wstrict-
 prototypes -Wpointer-arith -Wundef -Wshadow -Wfloat-equal -Waggregate-
 return -Wcast-qual -Wswitch-default -Wswitch-enum -Wunreachable-code
 -Wformat=2 -std=gnu11 -D_FILE_OFFSET_BITS=64 -fstrict-aliasing -pipe
 -DNO_ATIME -DNDEBUG -Wextra -Wstrict-overflow=5 -Winit-self
 -Wl,-stack_size -Wl,0x1000000 -DENABLE_DEDUPE  -I/opt/local/include
 -isysroot/Library/Developer/CommandLineTools/SDKs/MacOSX12.sdk  -c -o
 jdupes.o jdupes.c
 :info:build clang: warning: -Wl,-stack_size: 'linker' input unused
 [-Wunused-command-line-argument]
 :info:build clang: warning: -Wl,0x1000000: 'linker' input unused
 [-Wunused-command-line-argument]
 :info:build clang: warning: -Wl,-stack_size: 'linker' input unused
 [-Wunused-command-line-argument]
 :info:build clang: warning: -Wl,0x1000000: 'linker' input unused
 [-Wunused-command-line-argument]
 :info:build clang: warning: -Wl,-stack_size: 'linker' input unused
 [-Wunused-command-line-argument]
 :info:build clang: warning: -Wl,0x1000000: 'linker' input unused
 [-Wunused-command-line-argument]
 :info:build clang: warning: -Wl,-stack_size: 'linker' input unused
 [-Wunused-command-line-argument]
 :info:build clang: warning: -Wl,0x1000000: 'linker' input unused
 [-Wunused-command-line-argument]
 :info:build clang: warning: -Wl,-stack_size: 'linker' input unused
 [-Wunused-command-line-argument]
 :info:build clang: warning: -Wl,0x1000000: 'linker' input unused
 [-Wunused-command-line-argument]
 :info:build clang: warning: -Wl,-stack_size: 'linker' input unused
 [-Wunused-command-line-argument]
 :info:build clang: warning: -Wl,0x1000000: 'linker' input unused
 [-Wunused-command-line-argument]
 :info:build clang: warning: -Wl,-stack_size: 'linker' input unused
 [-Wunused-command-line-argument]
 :info:build clang: warning: -Wl,0x1000000: 'linker' input unused
 [-Wunused-command-line-argument]
 :info:build clang: warning: -Wl,-stack_size: 'linker' input unused
 [-Wunused-command-line-argument]
 :info:build clang: warning: -Wl,0x1000000: 'linker' input unused
 [-Wunused-command-line-argument]
 :info:build /opt/local/var/macports/build/jdupes-
 4717e162/work/compwrap/cc/usr/bin/clang -Os
 -isysroot/Library/Developer/CommandLineTools/SDKs/MacOSX12.sdk -arch
 x86_64 -Wall -Wwrite-strings -Wcast-align -Wstrict-aliasing -Wstrict-
 prototypes -Wpointer-arith -Wundef -Wshadow -Wfloat-equal -Waggregate-
 return -Wcast-qual -Wswitch-default -Wswitch-enum -Wunreachable-code
 -Wformat=2 -std=gnu11 -D_FILE_OFFSET_BITS=64 -fstrict-aliasing -pipe
 -DNO_ATIME -DNDEBUG -Wextra -Wstrict-overflow=5 -Winit-self
 -Wl,-stack_size -Wl,0x1000000 -DENABLE_DEDUPE  -I/opt/local/include
 -isysroot/Library/Developer/CommandLineTools/SDKs/MacOSX12.sdk  -c -o
 helptext.o helptext.c
 :info:build clang: warning: -Wl,-stack_size: 'linker' input unused
 [-Wunused-command-line-argument]
 :info:build clang: warning: -Wl,0x1000000: 'linker' input unused
 [-Wunused-command-line-argument]
 :info:build hashdb.c:497:41: warning: cast from 'char *' to 'uint64_t *'
 (aka 'unsigned long long *') increases required alignment from 1 to 8
 [-Wcast-align]
 :info:build   } else retval = jc_block_hash(NORMAL, (uint64_t *)path,
 path_hash, strlen(path));
 :info:build                                         ^~~~~~~~~~~~~~~~
 :info:build /opt/local/var/macports/build/jdupes-
 4717e162/work/compwrap/cc/usr/bin/clang -Os
 -isysroot/Library/Developer/CommandLineTools/SDKs/MacOSX12.sdk -arch
 x86_64 -Wall -Wwrite-strings -Wcast-align -Wstrict-aliasing -Wstrict-
 prototypes -Wpointer-arith -Wundef -Wshadow -Wfloat-equal -Waggregate-
 return -Wcast-qual -Wswitch-default -Wswitch-enum -Wunreachable-code
 -Wformat=2 -std=gnu11 -D_FILE_OFFSET_BITS=64 -fstrict-aliasing -pipe
 -DNO_ATIME -DNDEBUG -Wextra -Wstrict-overflow=5 -Winit-self
 -Wl,-stack_size -Wl,0x1000000 -DENABLE_DEDUPE  -I/opt/local/include
 -isysroot/Library/Developer/CommandLineTools/SDKs/MacOSX12.sdk  -c -o
 interrupt.o interrupt.c
 :info:build /opt/local/var/macports/build/jdupes-
 4717e162/work/compwrap/cc/usr/bin/clang -Os
 -isysroot/Library/Developer/CommandLineTools/SDKs/MacOSX12.sdk -arch
 x86_64 -Wall -Wwrite-strings -Wcast-align -Wstrict-aliasing -Wstrict-
 prototypes -Wpointer-arith -Wundef -Wshadow -Wfloat-equal -Waggregate-
 return -Wcast-qual -Wswitch-default -Wswitch-enum -Wunreachable-code
 -Wformat=2 -std=gnu11 -D_FILE_OFFSET_BITS=64 -fstrict-aliasing -pipe
 -DNO_ATIME -DNDEBUG -Wextra -Wstrict-overflow=5 -Winit-self
 -Wl,-stack_size -Wl,0x1000000 -DENABLE_DEDUPE  -I/opt/local/include
 -isysroot/Library/Developer/CommandLineTools/SDKs/MacOSX12.sdk  -c -o
 libjodycode_check.o libjodycode_check.c
 :info:build clang: warning: -Wl,-stack_size: 'linker' input unused
 [-Wunused-command-line-argument]
 :info:build clang: warning: -Wl,0x1000000: 'linker' input unused
 [-Wunused-command-line-argument]
 :info:build /opt/local/var/macports/build/jdupes-
 4717e162/work/compwrap/cc/usr/bin/clang -Os
 -isysroot/Library/Developer/CommandLineTools/SDKs/MacOSX12.sdk -arch
 x86_64 -Wall -Wwrite-strings -Wcast-align -Wstrict-aliasing -Wstrict-
 prototypes -Wpointer-arith -Wundef -Wshadow -Wfloat-equal -Waggregate-
 return -Wcast-qual -Wswitch-default -Wswitch-enum -Wunreachable-code
 -Wformat=2 -std=gnu11 -D_FILE_OFFSET_BITS=64 -fstrict-aliasing -pipe
 -DNO_ATIME -DNDEBUG -Wextra -Wstrict-overflow=5 -Winit-self
 -Wl,-stack_size -Wl,0x1000000 -DENABLE_DEDUPE  -I/opt/local/include
 -isysroot/Library/Developer/CommandLineTools/SDKs/MacOSX12.sdk  -c -o
 loaddir.o loaddir.c
 :info:build clang: warning: -Wl,-stack_size: 'linker' input unused
 [-Wunused-command-line-argument]
 :info:build clang: warning: -Wl,0x1000000: 'linker' input unused
 [-Wunused-command-line-argument]
 :info:build /opt/local/var/macports/build/jdupes-
 4717e162/work/compwrap/cc/usr/bin/clang -Os
 -isysroot/Library/Developer/CommandLineTools/SDKs/MacOSX12.sdk -arch
 x86_64 -Wall -Wwrite-strings -Wcast-align -Wstrict-aliasing -Wstrict-
 prototypes -Wpointer-arith -Wundef -Wshadow -Wfloat-equal -Waggregate-
 return -Wcast-qual -Wswitch-default -Wswitch-enum -Wunreachable-code
 -Wformat=2 -std=gnu11 -D_FILE_OFFSET_BITS=64 -fstrict-aliasing -pipe
 -DNO_ATIME -DNDEBUG -Wextra -Wstrict-overflow=5 -Winit-self
 -Wl,-stack_size -Wl,0x1000000 -DENABLE_DEDUPE  -I/opt/local/include
 -isysroot/Library/Developer/CommandLineTools/SDKs/MacOSX12.sdk  -c -o
 match.o match.c
 :info:build clang: warning: -Wl,-stack_size: 'linker' input unused
 [-Wunused-command-line-argument]
 :info:build clang: warning: -Wl,0x1000000: 'linker' input unused
 [-Wunused-command-line-argument]
 :info:build clang: warning: -Wl,-stack_size: 'linker' input unused
 [-Wunused-command-line-argument]
 :info:build clang: warning: -Wl,0x1000000: 'linker' input unused
 [-Wunused-command-line-argument]
 :info:build /opt/local/var/macports/build/jdupes-
 4717e162/work/compwrap/cc/usr/bin/clang -Os
 -isysroot/Library/Developer/CommandLineTools/SDKs/MacOSX12.sdk -arch
 x86_64 -Wall -Wwrite-strings -Wcast-align -Wstrict-aliasing -Wstrict-
 prototypes -Wpointer-arith -Wundef -Wshadow -Wfloat-equal -Waggregate-
 return -Wcast-qual -Wswitch-default -Wswitch-enum -Wunreachable-code
 -Wformat=2 -std=gnu11 -D_FILE_OFFSET_BITS=64 -fstrict-aliasing -pipe
 -DNO_ATIME -DNDEBUG -Wextra -Wstrict-overflow=5 -Winit-self
 -Wl,-stack_size -Wl,0x1000000 -DENABLE_DEDUPE  -I/opt/local/include
 -isysroot/Library/Developer/CommandLineTools/SDKs/MacOSX12.sdk  -c -o
 progress.o progress.c
 :info:build /opt/local/var/macports/build/jdupes-
 4717e162/work/compwrap/cc/usr/bin/clang -Os
 -isysroot/Library/Developer/CommandLineTools/SDKs/MacOSX12.sdk -arch
 x86_64 -Wall -Wwrite-strings -Wcast-align -Wstrict-aliasing -Wstrict-
 prototypes -Wpointer-arith -Wundef -Wshadow -Wfloat-equal -Waggregate-
 return -Wcast-qual -Wswitch-default -Wswitch-enum -Wunreachable-code
 -Wformat=2 -std=gnu11 -D_FILE_OFFSET_BITS=64 -fstrict-aliasing -pipe
 -DNO_ATIME -DNDEBUG -Wextra -Wstrict-overflow=5 -Winit-self
 -Wl,-stack_size -Wl,0x1000000 -DENABLE_DEDUPE  -I/opt/local/include
 -isysroot/Library/Developer/CommandLineTools/SDKs/MacOSX12.sdk  -c -o
 sort.o sort.c
 :info:build /opt/local/var/macports/build/jdupes-
 4717e162/work/compwrap/cc/usr/bin/clang -Os
 -isysroot/Library/Developer/CommandLineTools/SDKs/MacOSX12.sdk -arch
 x86_64 -Wall -Wwrite-strings -Wcast-align -Wstrict-aliasing -Wstrict-
 prototypes -Wpointer-arith -Wundef -Wshadow -Wfloat-equal -Waggregate-
 return -Wcast-qual -Wswitch-default -Wswitch-enum -Wunreachable-code
 -Wformat=2 -std=gnu11 -D_FILE_OFFSET_BITS=64 -fstrict-aliasing -pipe
 -DNO_ATIME -DNDEBUG -Wextra -Wstrict-overflow=5 -Winit-self
 -Wl,-stack_size -Wl,0x1000000 -DENABLE_DEDUPE  -I/opt/local/include
 -isysroot/Library/Developer/CommandLineTools/SDKs/MacOSX12.sdk  -c -o
 travcheck.o travcheck.c
 :info:build clang: warning: -Wl,-stack_size: 'linker' input unused
 [-Wunused-command-line-argument]
 :info:build clang: warning: -Wl,0x1000000: 'linker' input unused
 [-Wunused-command-line-argument]
 :info:build clang: warning: -Wl,-stack_size: 'linker' input unused
 [-Wunused-command-line-argument]
 :info:build clang: warning: -Wl,0x1000000: 'linker' input unused
 [-Wunused-command-line-argument]
 :info:build /opt/local/var/macports/build/jdupes-
 4717e162/work/compwrap/cc/usr/bin/clang -Os
 -isysroot/Library/Developer/CommandLineTools/SDKs/MacOSX12.sdk -arch
 x86_64 -Wall -Wwrite-strings -Wcast-align -Wstrict-aliasing -Wstrict-
 prototypes -Wpointer-arith -Wundef -Wshadow -Wfloat-equal -Waggregate-
 return -Wcast-qual -Wswitch-default -Wswitch-enum -Wunreachable-code
 -Wformat=2 -std=gnu11 -D_FILE_OFFSET_BITS=64 -fstrict-aliasing -pipe
 -DNO_ATIME -DNDEBUG -Wextra -Wstrict-overflow=5 -Winit-self
 -Wl,-stack_size -Wl,0x1000000 -DENABLE_DEDUPE  -I/opt/local/include
 -isysroot/Library/Developer/CommandLineTools/SDKs/MacOSX12.sdk  -c -o
 act_deletefiles.o act_deletefiles.c
 :info:build clang: warning: -Wl,-stack_size: 'linker' input unused
 [-Wunused-command-line-argument]
 :info:build clang: warning: -Wl,0x1000000: 'linker' input unused
 [-Wunused-command-line-argument]
 :info:build /opt/local/var/macports/build/jdupes-
 4717e162/work/compwrap/cc/usr/bin/clang -Os
 -isysroot/Library/Developer/CommandLineTools/SDKs/MacOSX12.sdk -arch
 x86_64 -Wall -Wwrite-strings -Wcast-align -Wstrict-aliasing -Wstrict-
 prototypes -Wpointer-arith -Wundef -Wshadow -Wfloat-equal -Waggregate-
 return -Wcast-qual -Wswitch-default -Wswitch-enum -Wunreachable-code
 -Wformat=2 -std=gnu11 -D_FILE_OFFSET_BITS=64 -fstrict-aliasing -pipe
 -DNO_ATIME -DNDEBUG -Wextra -Wstrict-overflow=5 -Winit-self
 -Wl,-stack_size -Wl,0x1000000 -DENABLE_DEDUPE  -I/opt/local/include
 -isysroot/Library/Developer/CommandLineTools/SDKs/MacOSX12.sdk  -c -o
 act_linkfiles.o act_linkfiles.c
 :info:build /opt/local/var/macports/build/jdupes-
 4717e162/work/compwrap/cc/usr/bin/clang -Os
 -isysroot/Library/Developer/CommandLineTools/SDKs/MacOSX12.sdk -arch
 x86_64 -Wall -Wwrite-strings -Wcast-align -Wstrict-aliasing -Wstrict-
 prototypes -Wpointer-arith -Wundef -Wshadow -Wfloat-equal -Waggregate-
 return -Wcast-qual -Wswitch-default -Wswitch-enum -Wunreachable-code
 -Wformat=2 -std=gnu11 -D_FILE_OFFSET_BITS=64 -fstrict-aliasing -pipe
 -DNO_ATIME -DNDEBUG -Wextra -Wstrict-overflow=5 -Winit-self
 -Wl,-stack_size -Wl,0x1000000 -DENABLE_DEDUPE  -I/opt/local/include
 -isysroot/Library/Developer/CommandLineTools/SDKs/MacOSX12.sdk  -c -o
 act_printmatches.o act_printmatches.c
 :info:build clang: warning: -Wl,-stack_size: 'linker' input unused
 [-Wunused-command-line-argument]
 :info:build clang: warning: -Wl,0x1000000: 'linker' input unused
 [-Wunused-command-line-argument]
 :info:build /opt/local/var/macports/build/jdupes-
 4717e162/work/compwrap/cc/usr/bin/clang -Os
 -isysroot/Library/Developer/CommandLineTools/SDKs/MacOSX12.sdk -arch
 x86_64 -Wall -Wwrite-strings -Wcast-align -Wstrict-aliasing -Wstrict-
 prototypes -Wpointer-arith -Wundef -Wshadow -Wfloat-equal -Waggregate-
 return -Wcast-qual -Wswitch-default -Wswitch-enum -Wunreachable-code
 -Wformat=2 -std=gnu11 -D_FILE_OFFSET_BITS=64 -fstrict-aliasing -pipe
 -DNO_ATIME -DNDEBUG -Wextra -Wstrict-overflow=5 -Winit-self
 -Wl,-stack_size -Wl,0x1000000 -DENABLE_DEDUPE  -I/opt/local/include
 -isysroot/Library/Developer/CommandLineTools/SDKs/MacOSX12.sdk  -c -o
 act_summarize.o act_summarize.c
 :info:build /opt/local/var/macports/build/jdupes-
 4717e162/work/compwrap/cc/usr/bin/clang -Os
 -isysroot/Library/Developer/CommandLineTools/SDKs/MacOSX12.sdk -arch
 x86_64 -Wall -Wwrite-strings -Wcast-align -Wstrict-aliasing -Wstrict-
 prototypes -Wpointer-arith -Wundef -Wshadow -Wfloat-equal -Waggregate-
 return -Wcast-qual -Wswitch-default -Wswitch-enum -Wunreachable-code
 -Wformat=2 -std=gnu11 -D_FILE_OFFSET_BITS=64 -fstrict-aliasing -pipe
 -DNO_ATIME -DNDEBUG -Wextra -Wstrict-overflow=5 -Winit-self
 -Wl,-stack_size -Wl,0x1000000 -DENABLE_DEDUPE  -I/opt/local/include
 -isysroot/Library/Developer/CommandLineTools/SDKs/MacOSX12.sdk  -c -o
 act_printjson.o act_printjson.c
 :info:build clang: warning: -Wl,-stack_size: 'linker' input unused
 [-Wunused-command-line-argument]
 :info:build clang: warning: -Wl,0x1000000: 'linker' input unused
 [-Wunused-command-line-argument]
 :info:build clang: warning: -Wl,-stack_size: 'linker' input unused
 [-Wunused-command-line-argument]
 :info:build clang: warning: -Wl,0x1000000: 'linker' input unused
 [-Wunused-command-line-argument]
 :info:build clang: warning: -Wl,-stack_size: 'linker' input unused
 [-Wunused-command-line-argument]
 :info:build clang: warning: -Wl,0x1000000: 'linker' input unused
 [-Wunused-command-line-argument]
 :info:build clang: warning: -Wl,-stack_size: 'linker' input unused
 [-Wunused-command-line-argument]
 :info:build clang: warning: -Wl,0x1000000: 'linker' input unused
 [-Wunused-command-line-argument]
 :info:build 1 warning generated.
 :info:build /opt/local/var/macports/build/jdupes-
 4717e162/work/compwrap/cc/usr/bin/clang -Os
 -isysroot/Library/Developer/CommandLineTools/SDKs/MacOSX12.sdk -arch
 x86_64 -Wall -Wwrite-strings -Wcast-align -Wstrict-aliasing -Wstrict-
 prototypes -Wpointer-arith -Wundef -Wshadow -Wfloat-equal -Waggregate-
 return -Wcast-qual -Wswitch-default -Wswitch-enum -Wunreachable-code
 -Wformat=2 -std=gnu11 -D_FILE_OFFSET_BITS=64 -fstrict-aliasing -pipe
 -DNO_ATIME -DNDEBUG -Wextra -Wstrict-overflow=5 -Winit-self
 -Wl,-stack_size -Wl,0x1000000 -DENABLE_DEDUPE  -I/opt/local/include
 -isysroot/Library/Developer/CommandLineTools/SDKs/MacOSX12.sdk  -c -o
 xxhash.o xxhash.c
 :info:build /opt/local/var/macports/build/jdupes-
 4717e162/work/compwrap/cc/usr/bin/clang -Os
 -isysroot/Library/Developer/CommandLineTools/SDKs/MacOSX12.sdk -arch
 x86_64 -Wall -Wwrite-strings -Wcast-align -Wstrict-aliasing -Wstrict-
 prototypes -Wpointer-arith -Wundef -Wshadow -Wfloat-equal -Waggregate-
 return -Wcast-qual -Wswitch-default -Wswitch-enum -Wunreachable-code
 -Wformat=2 -std=gnu11 -D_FILE_OFFSET_BITS=64 -fstrict-aliasing -pipe
 -DNO_ATIME -DNDEBUG -Wextra -Wstrict-overflow=5 -Winit-self
 -Wl,-stack_size -Wl,0x1000000 -DENABLE_DEDUPE  -I/opt/local/include
 -isysroot/Library/Developer/CommandLineTools/SDKs/MacOSX12.sdk  -c -o
 act_dedupefiles.o act_dedupefiles.c
 :info:build clang: warning: -Wl,-stack_size: 'linker' input unused
 [-Wunused-command-line-argument]
 :info:build clang: warning: -Wl,0x1000000: 'linker' input unused
 [-Wunused-command-line-argument]
 :info:build clang: warning: -Wl,-stack_size: 'linker' input unused
 [-Wunused-command-line-argument]
 :info:build clang: warning: -Wl,0x1000000: 'linker' input unused
 [-Wunused-command-line-argument]
 :info:build act_linkfiles.c:365:23: error: label at end of compound
 statement: expected statement
 :info:build               default:
 :info:build                       ^
 :info:build                        ;
 :info:build 1 error generated.
 :info:build make: *** [act_linkfiles.o] Error 1
 :info:build make: *** Waiting for unfinished jobs....
 :info:build make: Leaving directory `/opt/local/var/macports/build/jdupes-
 4717e162/work/v1.31.1'
 :info:build Command failed:  cd "/opt/local/var/macports/build/jdupes-
 4717e162/work/v1.31.1" && /usr/bin/make -j8 -w all ENABLE_DEDUPE=1
 PREFIX=/opt/local CC="/opt/local/var/macports/build/jdupes-
 4717e162/work/compwrap/cc/usr/bin/clang"
 CXX="/opt/local/var/macports/build/jdupes-
 4717e162/work/compwrap/cxx/usr/bin/clang++"
 OBJC="/opt/local/var/macports/build/jdupes-
 4717e162/work/compwrap/objc/usr/bin/clang"
 OBJCXX="/opt/local/var/macports/build/jdupes-
 4717e162/work/compwrap/objcxx/usr/bin/clang++"
 INSTALL="/opt/local/libexec/macports/clonebin/install"
 :info:build Exit code: 2
 :error:build Failed to build jdupes: command execution failed
 :debug:build Error code: CHILDSTATUS 64683 2
 :debug:build Backtrace: command execution failed
 :debug:build     while executing
 :debug:build "system {*}$notty {*}$callback {*}$nice $fullcmdstring"
 :debug:build     invoked from within
 :debug:build "command_exec -callback
 portprogress::target_progress_callback build"
 :debug:build     (procedure "portbuild::build_main" line 10)
 :debug:build     invoked from within
 :debug:build "$procedure $targetname"
 :error:build See
 /opt/local/var/macports/logs/_opt_local_var_macports_sources_rsync.macports.org_macports_release_tarballs_ports_sysutils_jdupes/jdupes/main.log
 for details.

 }}}

-- 
Ticket URL: <https://trac.macports.org/ticket/73896#comment:1>
MacPorts <https://www.macports.org/>
Ports system for macOS


More information about the macports-tickets mailing list