May 2026 Archives by date
Starting: Fri May 1 00:09:07 UTC 2026
Ending: Sun May 31 21:35:35 UTC 2026
Messages: 669
- [MacPorts] #73923: tcl9 fails to build on Leopard
MacPorts
- [MacPorts] #73875: qt58-qtbase: Feature 'icu' fails, but it is required
MacPorts
- [MacPorts] #73948: gnutls 3.8.13 fails to build on macOS 13 Intel due to crau/audit compilation errors
MacPorts
- [MacPorts] #73922: rsync: The job "org.macports.rsyncd" is PERMANENTLY DISABLED??
MacPorts
- [MacPorts] #73944: gnutls @3.8.13_0 fails to build on macOS 12/13 (Apple Clang 14) due to CRAU_MAYBE_UNUSED undefined
MacPorts
- [MacPorts] #73942: gnutls @3.8.13: error: expected ')'
MacPorts
- [MacPorts] #73947: libwmf at 0.2.15 upgrade fails
MacPorts
- [MacPorts] #73942: gnutls @3.8.13: error: expected ')'
MacPorts
- [MacPorts] #73923: tcl9 fails to build on Leopard
MacPorts
- [MacPorts] #73923: tcl9 fails to build on Leopard
MacPorts
- [MacPorts] #73923: tcl9 fails to build on Leopard
MacPorts
- [MacPorts] #73941: request: https://github.com/notepad-plus-plus-mac/notepad-plus-plus-macos/
MacPorts
- [MacPorts] #73923: tcl9 fails to build on Leopard
MacPorts
- [MacPorts] #73892: mysql8-server @8.4.8 fails to initialise on macOS High Sierra, Version 10.13.6
MacPorts
- [MacPorts] #71853: p5.34-dbd-pg @3.18.0 fails tests
MacPorts
- [MacPorts] #71762: fswatch @1.18.0 has a git problem on macOS High Sierra, version 10.13.6, while configuring
MacPorts
- [MacPorts] #71221: Testing p5.34-fcgi fails because FCGI::Client is not installed
MacPorts
- [MacPorts] #71231: p5-sub-handlesvia test 50objectpad.t fails because it uses has instead of field
MacPorts
- [MacPorts] #71297: postgresql16 @16.4 fails test because of too long path name of socket
MacPorts
- Re: [MacPorts] #73929: p5.34-dbd-mysql @5.13.0 re-builds itself before testing – and needs an extra argument to actually test the MySQL db
MacPorts
- [MacPorts] #73948: gnutls 3.8.13 fails to build on macOS 13 Intel due to crau/audit compilation errors
MacPorts
- [MacPorts] #73949: libwmf 0.2.15: build fails when an older libwmf is already installed (incomplete fix in f79f336322e)
MacPorts
- [MacPorts] #73950: zig @0.16.0: unable to cross compile a simple windows test program with exception: missing ` __emutls_get_address`
MacPorts
- [MacPorts] #73934: py-Pillow: opportunistically links to libavif
MacPorts
- [MacPorts] #73951: error:build Failed to build py314-mypy: command execution failed
MacPorts
- [MacPorts] #72814: cadaver @0.24: incompatible neon library version 0.33.0: wanted 0.27 28 29 30 31 32
MacPorts
- [MacPorts] #72814: cadaver @0.24: incompatible neon library version 0.33.0: wanted 0.27 28 29 30 31 32
MacPorts
- [MacPorts] #73952: libelf @0.8.13_5+universal Generated `libelf.dylib` is not universal
MacPorts
- [MacPorts] #73588: cmake-devel: update to 4.3
MacPorts
- [MacPorts] #73952: libelf @0.8.13_5+universal Generated `libelf.dylib` is not universal
MacPorts
- [MacPorts] #73934: py-Pillow: opportunistically links to libavif
MacPorts
- [MacPorts] #71231: p5-sub-handlesvia test 50objectpad.t fails because it uses has instead of field
MacPorts
- [MacPorts] #73951: error:build Failed to build py314-mypy: command execution failed
MacPorts
- [MacPorts] #73949: libwmf 0.2.15: build fails when an older libwmf is already installed (incomplete fix in f79f336322e)
MacPorts
- [MacPorts] #71853: p5.34-dbd-pg @3.18.0 fails tests
MacPorts
- [MacPorts] #71297: postgresql16 @16.4 fails test because of too long path name of socket
MacPorts
- [MacPorts] #71762: fswatch @1.18.0 has a git problem on macOS High Sierra, version 10.13.6, while configuring
MacPorts
- [MacPorts] #71221: Testing p5.34-fcgi fails because FCGI::Client is not installed
MacPorts
- [MacPorts] #40811: cairo, cairo-devel: --enable-xcb-shm breaks many gtk3 apps since gtk3 3.10
MacPorts
- [MacPorts] #73951: error:build Failed to build py314-mypy: command execution failed
MacPorts
- [MacPorts] #73951: error:build Failed to build py314-mypy: command execution failed
MacPorts
- [MacPorts] #73951: error:build Failed to build py314-mypy: command execution failed
MacPorts
- [MacPorts] #73952: libelf @0.8.13_5+universal Generated `libelf.dylib` is not universal
MacPorts
- [MacPorts] #71297: postgresql16 @16.4 fails test because of too long path name of socket
MacPorts
- [MacPorts] #73907: Please create new port for pdftl
MacPorts
- [MacPorts] #73907: Please create new port for pdftl
MacPorts
- [MacPorts] #73907: Please create new port for pdftl
MacPorts
- [MacPorts] #71297: postgresql16 @16.4 fails test because of too long path name of socket
MacPorts
- [MacPorts] #73603: giflib6
MacPorts
- [MacPorts] #73953: giflib5: install under libexec
MacPorts
- [MacPorts] #73954: mpv seg faults on EXC_BAD_ACCESS
MacPorts
- [MacPorts] #73907: Please create new port for pdftl
MacPorts
- [MacPorts] #73949: libwmf 0.2.15: build fails when an older libwmf is already installed (incomplete fix in f79f336322e)
MacPorts
- [MacPorts] #73945: aacgain: deprecate (orphaned, unmaintained upstream since 2010, multiple unpatched CVEs; replace with mp3rgain)
MacPorts
- [MacPorts] #73950: zig @0.16.0: unable to cross compile a simple windows test program with exception: missing ` __emutls_get_address`
MacPorts
- [MacPorts] #73954: mpv seg faults on EXC_BAD_ACCESS
MacPorts
- [MacPorts] #73954: mpv seg faults on EXC_BAD_ACCESS
MacPorts
- [MacPorts] #73955: expat +universal: muniversal merge of expat_config.hproduces anar archive when cross-compiling arm64 from an x86_64 host
MacPorts
- [MacPorts] #73955: expat +universal: muniversal merge of expat_config.hproduces anar archive when cross-compiling arm64 from an x86_64 host
MacPorts
- [MacPorts] #73955: expat +universal: muniversal merge of expat_config.hproduces anar archive when cross-compiling arm64 from an x86_64 host
MacPorts
- [MacPorts] #73956: python314 +universal: missing --with-universal-archs=universal2 causes HACL Blake2 SIMD256 build failure on Intel hosts
MacPorts
- [MacPorts] #73957: (10.14) failed to build rust > ninja subcommand failed
MacPorts
- [MacPorts] #73957: (10.14) failed to build rust > ninja subcommand failed
MacPorts
- [MacPorts] #73957: (10.14) failed to build rust > ninja subcommand failed
MacPorts
- [MacPorts] #73957: (10.14) failed to build rust > ninja subcommand failed
MacPorts
- [MacPorts] #73945: aacgain: deprecate (orphaned, unmaintained upstream since 2010, multiple unpatched CVEs; replace with mp3rgain)
MacPorts
- [MacPorts] #73955: expat +universal: muniversal merge of expat_config.hproduces anar archive when cross-compiling arm64 from an x86_64 host
MacPorts
- [MacPorts] #73956: python314 +universal: missing --with-universal-archs=universal2 causes HACL Blake2 SIMD256 build failure on Intel hosts
MacPorts
- [MacPorts] #73958: gstreamer1-gst-plugins-bad @1.28.2_1 error: unrecognized platform name visionos (macOS < 13)
MacPorts
- [MacPorts] #73958: gstreamer1-gst-plugins-bad @1.28.2_1 error: unrecognized platform name visionos (macOS < 13)
MacPorts
- [MacPorts] #73957: rust @1.95.0: error: use of overloaded operator '!=' is ambiguous (was: (10.14) failed to build rust > ninja subcommand failed)
MacPorts
- [MacPorts] #73957: rust @1.95.0: error: use of overloaded operator '!=' is ambiguous
MacPorts
- [MacPorts] #72814: cadaver @0.24: incompatible neon library version 0.33.0: wanted 0.27 28 29 30 31 32
MacPorts
- [MacPorts] #73959: please create the node.js 'big-integer' module as a new port
MacPorts
- [MacPorts] #73920: mpv @0.41.0_1+audiocd+bluray+bundle+dvd+libarchive+libmpv+network_ytdlp+opengl+osd+python314+rubberband: on tahoe, 1/10 time no video (audio only) + the app is unresponsive, needs to be force quit
MacPorts
- [MacPorts] #73959: please create the node.js 'big-integer' module as a new port
MacPorts
- [MacPorts] #73920: mpv @0.41.0_1+audiocd+bluray+bundle+dvd+libarchive+libmpv+network_ytdlp+opengl+osd+python314+rubberband: on tahoe, 1/10 time no video (audio only) + the app is unresponsive, needs to be force quit
MacPorts
- [MacPorts] #73954: mpv seg faults on EXC_BAD_ACCESS
MacPorts
- [MacPorts] #73959: please create the node.js 'big-integer' module as a new port
MacPorts
- [MacPorts] #73954: mpv seg faults on EXC_BAD_ACCESS
MacPorts
- Re: [MacPorts] #73929: p5.34-dbd-mysql @5.13.0 re-builds itself before testing – and needs an extra argument to actually test the MySQL db
MacPorts
- [MacPorts] #73919: libplacebo @7.360.1_0+opengl+vulkan+glslang: cannot build with glslang due to src/glsl/meson.build:52:16: ERROR: C++ static library 'SPIRV' not found
MacPorts
- [MacPorts] #73960: rubberband: update to 4.0.0
MacPorts
- [MacPorts] #73961: mariadb-10.11 @10.11.13_1 cannot be initialised on macOS Sonoma 14.8.5 because of: sudo: /opt/local/lib/mariadb-10.11/bin/mariadb_install_db: command not found
MacPorts
- [MacPorts] #73962: When running 'sudo -u _mysql /opt/local/lib/mariadb-10.11/bin/mariadb-install-db' the recommended test command fails
MacPorts
- [MacPorts] #73920: mpv @0.41.0_1+audiocd+bluray+bundle+dvd+libarchive+libmpv+network_ytdlp+opengl+osd+python314+rubberband: on tahoe, 1/10 time no video (audio only) + the app is unresponsive, needs to be force quit
MacPorts
- [MacPorts] #73920: mpv @0.41.0_1+audiocd+bluray+bundle+dvd+libarchive+libmpv+network_ytdlp+opengl+osd+python314+rubberband: on tahoe, 1/10 time no video (audio only) + the app is unresponsive, needs to be force quit
MacPorts
- [MacPorts] #73950: zig @0.16.0: unable to cross compile a simple windows test program with exception: missing ` __emutls_get_address`
MacPorts
- [MacPorts] #73907: Please create new port for pdftl
MacPorts
- [MacPorts] #73963: Unable to install py314-mypy
MacPorts
- [MacPorts] #73963: Unable to install py314-mypy
MacPorts
- [MacPorts] #73963: py314-mypy @1.20.2 build failure: No module named 'typing_extensions' (was: Unable to install py314-mypy)
MacPorts
- [MacPorts] #73963: py314-mypy @1.20.2 build failure: No module named 'typing_extensions'
MacPorts
- [MacPorts] #70674: MacPorts Sync: Sync fails with error - Error: process_cmd failed: sqlite error: another row available
MacPorts
- [MacPorts] #73870: 'sudo port -vst install' crashes with SIGSEGV
MacPorts
- [MacPorts] #73954: mpv seg faults on EXC_BAD_ACCESS
MacPorts
- [MacPorts] #73916: wine-stable doesn't install on a brand new Tahoe M5 due to python313 +lto+optimizations+universal fetch and build errors
MacPorts
- [MacPorts] #73964: pxlib: needs revbump for libxml2
MacPorts
- [MacPorts] #73953: giflib5: install under libexec
MacPorts
- [MacPorts] #73603: giflib6
MacPorts
- [MacPorts] #70133: glibmm: drop dependency on glibmm-2.4
MacPorts
- [MacPorts] #71724: glib2: update to 2.88.0
MacPorts
- [MacPorts] #71810: gtk4: update to 4.22.1
MacPorts
- [MacPorts] #73046: pango: update to 1.57.0
MacPorts
- [MacPorts] #73965: glib2 upgrade fails: "Error: GLib: identifier not found on the first line"
MacPorts
- [MacPorts] #73965: glib2 upgrade fails: "Error: GLib: identifier not found on the first line"
MacPorts
- [MacPorts] #73965: glib2 upgrade fails: "Error: GLib: identifier not found on the first line"
MacPorts
- [MacPorts] #73965: glib2 upgrade fails: "Error: GLib: identifier not found on the first line"
MacPorts
- [MacPorts] #73966: gnutls @3.8.13: compiling from source code freezes on macOS 10.8
MacPorts
- [MacPorts] #73965: glib2 upgrade fails: "Error: GLib: identifier not found on the first line"
MacPorts
- [MacPorts] #73967: mariadb-10.11-server should launch mysqld/mariadbd with --ssl
MacPorts
- [MacPorts] #73965: glib2 upgrade fails: "Error: GLib: identifier not found on the first line"
MacPorts
- [MacPorts] #73968: py-curl-cffi: build from source, avoid installing an opaque binary blob
MacPorts
- [MacPorts] #73965: glib2 upgrade fails: "Error: GLib: identifier not found on the first line"
MacPorts
- [MacPorts] #73965: glib2 upgrade fails: "Error: GLib: identifier not found on the first line"
MacPorts
- [MacPorts] #73965: glib2 upgrade fails: "Error: GLib: identifier not found on the first line"
MacPorts
- [MacPorts] #73965: glib2 upgrade fails: "Error: GLib: identifier not found on the first line"
MacPorts
- [MacPorts] #73965: glib2 upgrade fails: "Error: GLib: identifier not found on the first line"
MacPorts
- [MacPorts] #73965: glib2 upgrade fails: "Error: GLib: identifier not found on the first line"
MacPorts
- [MacPorts] #73854: oracle-instantclient: automatic download of distfiles no longer possible ; outdated versions ; updated archs
MacPorts
- [MacPorts] #73969: glib2 error
MacPorts
- [MacPorts] #73969: glib2 error
MacPorts
- [MacPorts] #73970: mas: Update port to version v7.0.0
MacPorts
- [MacPorts] #73970: mas: Update port to version v7.0.0
MacPorts
- [MacPorts] #73968: py-curl-cffi: build from source, avoid installing an opaque binary blob
MacPorts
- [MacPorts] #73965: glib2 upgrade fails: "Error: GLib: identifier not found on the first line"
MacPorts
- [MacPorts] #73969: glib2 error
MacPorts
- [MacPorts] #73965: glib2 upgrade fails: "Error: GLib: identifier not found on the first line"
MacPorts
- [MacPorts] #73965: glib2 upgrade fails: "Error: GLib: identifier not found on the first line"
MacPorts
- [MacPorts] #73907: Please create new port for pdftl
MacPorts
- [MacPorts] #73971: mariadb-11.4-server gives wrong recommendations
MacPorts
- [MacPorts] #73970: mas: Update port to version v7.0.0
MacPorts
- [MacPorts] #73949: libwmf 0.2.15: build fails when an older libwmf is already installed (incomplete fix in f79f336322e)
MacPorts
- [MacPorts] #73949: libwmf 0.2.15: build fails when an older libwmf is already installed (incomplete fix in f79f336322e)
MacPorts
- [MacPorts] #73907: Please create new port for pdftl
MacPorts
- [MacPorts] #73455: findutils: cannot use locate; updatedb apparently fails to do anything useful!
MacPorts
- [MacPorts] #73907: Please create new port for pdftl
MacPorts
- [MacPorts] #73907: Please create new port for pdftl
MacPorts
- [MacPorts] #73907: Please create new port for pdftl
MacPorts
- [MacPorts] #73455: findutils: cannot use locate; updatedb apparently fails to do anything useful!
MacPorts
- [MacPorts] #73455: findutils: cannot use locate; updatedb apparently fails to do anything useful!
MacPorts
- [MacPorts] #73455: findutils: cannot use locate; updatedb apparently fails to do anything useful!
MacPorts
- [MacPorts] #73854: oracle-instantclient: automatic download of distfiles no longer possible ; outdated versions ; updated archs
MacPorts
- [MacPorts] #73701: buildmaster stuck with kernel_task using 100% CPU
MacPorts
- [MacPorts] #73883: gtk4 @4.14.3_0+x11 configure failure
MacPorts
- [MacPorts] #69876: pango @1.52.2 does not build on PPC Tiger, Mac OS X 10.4.11, because help2man: can't get `--help-all' info from .../pango-view
MacPorts
- [MacPorts] #71144: pango-devel @1.54.0 does build but not install on PPC Tiger, Mac OS X 10.4.11, because of problem with help2man
MacPorts
- [MacPorts] #73862: pango-devel @1.57.1 does not build on PPC Leopard, Mac OS X 10.5.8, because glib-2.0 has wrong version for Meson
MacPorts
- [MacPorts] #73971: mariadb-11.4-server gives wrong recommendations
MacPorts
- [MacPorts] #73972: Error: Failed to configure gobject-introspection: configure failure: command execution failed
MacPorts
- [MacPorts] #73972: Error: Failed to configure gobject-introspection: configure failure: command execution failed
MacPorts
- [MacPorts] #73972: Error: Failed to configure gobject-introspection: configure failure: command execution failed
MacPorts
- [MacPorts] #73622: mariadb-10.6 @10.6.21: build failure due to redefinition of libxml2 enumerators
MacPorts
- [MacPorts] #73622: mariadb-10.6 @10.6.21: build failure due to redefinition of libxml2 enumerators
MacPorts
- [MacPorts] #73973: mariadb-10.11 @10.11.13 does not have a log file
MacPorts
- [MacPorts] #73950: zig @0.16.0: unable to cross compile a simple windows test program with exception: missing ` __emutls_get_address`
MacPorts
- [MacPorts] #73907: Please create new port for pdftl
MacPorts
- [MacPorts] #73972: Error: Failed to configure gobject-introspection: configure failure: command execution failed
MacPorts
- [MacPorts] #73972: Error: Failed to configure gobject-introspection: configure failure: command execution failed
MacPorts
- [MacPorts] #73883: gtk4 @4.14.3_0+x11 configure failure
MacPorts
- [MacPorts] #73883: gtk4 @4.14.3_0+x11 configure failure
MacPorts
- [MacPorts] #71697: multiple ports: vala is specified as lib dependency rather than build dependency
MacPorts
- [MacPorts] #71697: multiple ports: vala is specified as lib dependency rather than build dependency
MacPorts
- [MacPorts] #73974: mysql8 8.4.8 Port notes lack crucial macports-specific steps before start server
MacPorts
- [MacPorts] #73972: Error: Failed to configure gobject-introspection: configure failure: command execution failed
MacPorts
- [MacPorts] #73972: Error: Failed to configure gobject-introspection: configure failure: command execution failed
MacPorts
- [MacPorts] #73975: Warning: No port py38-lxml found in the index; can't rebuild
MacPorts
- [MacPorts] #73974: mysql8 8.4.8 Port notes lack crucial macports-specific steps before start server
MacPorts
- [MacPorts] #73975: openjdk11 @11.0.31_0+release+server broken linking after rebuilding (was: Warning: No port py38-lxml found in the index; can't rebuild)
MacPorts
- [MacPorts] #73975: openjdk11 @11.0.31_0+release+server broken linking after rebuilding
MacPorts
- [MacPorts] #69960: ocaml-configurator fails to build: Error: I cannot find the root of the current workspace/project
MacPorts
- [MacPorts] #73975: openjdk11 @11.0.31_0+release+server broken linking after rebuilding
MacPorts
- [MacPorts] #73975: openjdk11 @11.0.31_0+release+server broken linking after rebuilding
MacPorts
- [MacPorts] #73975: openjdk11 @11.0.31_0+release+server broken linking after rebuilding
MacPorts
- [MacPorts] #73976: Failed to configure glib2-bootstrap: configure failure: command execution failed
MacPorts
- [MacPorts] #73976: Failed to configure glib2-bootstrap: configure failure: command execution failed
MacPorts
- [MacPorts] #73977: p5-dbd-mariadb fails testing because of default initialisation of MariaDB
MacPorts
- [MacPorts] #73977: p5-dbd-mariadb fails testing because of default initialisation of MariaDB
MacPorts
- [MacPorts] #73978: port patch with os.major=X should not care about a "platform mismatch"
MacPorts
- [MacPorts] #73978: port patch with os.major=X should not care about a "platform mismatch"
MacPorts
- [MacPorts] #73976: Failed to configure glib2-bootstrap: configure failure: command execution failed
MacPorts
- [MacPorts] #73977: p5-dbd-mariadb fails testing because of default initialisation of MariaDB
MacPorts
- [MacPorts] #73977: p5-dbd-mariadb fails testing because of default initialisation of MariaDB
MacPorts
- [MacPorts] #73977: p5-dbd-mariadb fails testing because of default initialisation of MariaDB
MacPorts
- [MacPorts] #73962: When running 'sudo -u _mysql /opt/local/lib/mariadb-10.11/bin/mariadb-install-db' the recommended test command fails
MacPorts
- Re: [MacPorts] #73929: p5.34-dbd-mysql @5.13.0 re-builds itself before testing – and needs an extra argument to actually test the MySQL db
MacPorts
- [MacPorts] #73506: yfinance: port request
MacPorts
- [MacPorts] #73976: Failed to configure glib2-bootstrap: configure failure: command execution failed
MacPorts
- [MacPorts] #73976: glib2-bootstrap @2.88.1_0+universal+x11 Failed to configure (was: Failed to configure glib2-bootstrap: configure failure: command execution failed)
MacPorts
- [MacPorts] #73976: glib2-bootstrap @2.88.1_0+universal+x11 Failed to configure
MacPorts
- [MacPorts] #73978: port patch with os.major=X should not care about a "platform mismatch"
MacPorts
- [MacPorts] #73506: yfinance: port request
MacPorts
- [MacPorts] #73455: findutils: cannot use locate; updatedb apparently fails to do anything useful!
MacPorts
- [MacPorts] #73976: glib2-bootstrap @2.88.1_0+universal+x11 Failed to configure
MacPorts
- [MacPorts] #73976: glib2-bootstrap @2.88.1_0+universal+x11 Failed to configure
MacPorts
- [MacPorts] #73976: glib2-bootstrap @2.88.1_0+universal+x11 Failed to configure
MacPorts
- [MacPorts] #65623: ffmpeg: update to 8.x (was: ffmpeg: update to 7.x)
MacPorts
- [MacPorts] #73976: glib2-bootstrap @2.88.1_0+universal+x11 Failed to configure
MacPorts
- [MacPorts] #73976: glib2-bootstrap @2.88.1_0+universal+x11 Failed to configure
MacPorts
- [MacPorts] #73976: glib2-bootstrap @2.88.1_0+universal+x11 Failed to configure
MacPorts
- [MacPorts] #73463: rdkit needs libatomic with gcc on 32-bit archs
MacPorts
- [MacPorts] #73976: glib2-bootstrap @2.88.1_0+universal+x11 Failed to configure
MacPorts
- [MacPorts] #73979: buildbot-0.8: limit range of waterfall last_time parameter
MacPorts
- [MacPorts] #73976: glib2-bootstrap @2.88.1_0+universal+x11 Failed to configure
MacPorts
- [MacPorts] #73979: buildbot-0.8: limit range of waterfall last_time parameter
MacPorts
- [MacPorts] #73979: buildbot-0.8: limit range of waterfall last_time parameter
MacPorts
- [MacPorts] #45294: Request for a new port - toxcore
MacPorts
- [MacPorts] #71252: qwt: request for new subport for Qt6
MacPorts
- [MacPorts] #73980: yfinance installs a generic-name binary that fails to run: ModuleNotFoundError: No module named 'sample'
MacPorts
- [MacPorts] #73981: boost176 @1.76.0: Error: lchown: /opt/local/var/macports/build/boost176-c4ee76cb/work/boost_1_76_0/libs/beast: no such file or directory
MacPorts
- [MacPorts] #73981: boost176 @1.76.0: Error: lchown: /opt/local/var/macports/build/boost176-c4ee76cb/work/boost_1_76_0/libs/beast: no such file or directory
MacPorts
- [MacPorts] #73946: libgnomeui @2.24.5: error: incompatible function pointer types
MacPorts
- [MacPorts] #72809: gtk4 building failure: 'epoxy/glx.h' file not found
MacPorts
- [MacPorts] #73980: yfinance installs a generic-name binary that fails to run: ModuleNotFoundError: No module named 'sample'
MacPorts
- [MacPorts] #45294: Request for a new port - toxcore
MacPorts
- [MacPorts] #73982: clang_select-22: `port select --set clang mp-clang-22` fails due to missing c-index-test-mp-22
MacPorts
- [MacPorts] #73983: Recent vim update suffers from: "causes 'pp' to be shown on 1st line of file edited with vim"
MacPorts
- [MacPorts] #73911: gsed 4.10_0 does not build on PPC Mac OS X 10.5.8, Leopard, because patch-gsed-remove-pragmas.diff is too much
MacPorts
- [MacPorts] #73982: clang_select-22: `port select --set clang mp-clang-22` fails due to missing c-index-test-mp-22
MacPorts
- [MacPorts] #73981: boost176 @1.76.0: Error: lchown: /opt/local/var/macports/build/boost176-c4ee76cb/work/boost_1_76_0/libs/beast: no such file or directory
MacPorts
- [MacPorts] #73983: Recent vim update suffers from: "causes 'pp' to be shown on 1st line of file edited with vim"
MacPorts
- [MacPorts] #73981: boost176 @1.76.0: Error: lchown: /opt/local/var/macports/build/boost176-c4ee76cb/work/boost_1_76_0/libs/beast: no such file or directory
MacPorts
- [MacPorts] #73981: boost176 @1.76.0: Error: lchown: /opt/local/var/macports/build/boost176-c4ee76cb/work/boost_1_76_0/libs/beast: no such file or directory
MacPorts
- [MacPorts] #73981: boost176 @1.76.0: Error: lchown: /opt/local/var/macports/build/boost176-c4ee76cb/work/boost_1_76_0/libs/beast: no such file or directory
MacPorts
- [MacPorts] #40656: Use -isystem instead of -I in default configure.cppflags
MacPorts
- [MacPorts] #73796: muniversal portgroup: Text file merging is broken on Tahoe
MacPorts
- [MacPorts] #73796: muniversal portgroup: Text file merging is broken on Tahoe
MacPorts
- [MacPorts] #73455: findutils: cannot use locate; updatedb apparently fails to do anything useful!
MacPorts
- [MacPorts] #73984: pango at 1.57.1: build fails with Apple clang 21 — comma-separated -Werror specifier rejected
MacPorts
- [MacPorts] #73985: starship port fails due to rust ?!
MacPorts
- [MacPorts] #73946: libgnomeui @2.24.5: error: incompatible function pointer types
MacPorts
- Re: [MacPorts] #73984: pango at 1.57.1: build fails with Apple clang 21 — comma-separated -Werror specifier rejected
MacPorts
- [MacPorts] #73985: starship port fails due to rust ?!
MacPorts
- [MacPorts] #65492: webkit2-gtk update?
MacPorts
- Re: [MacPorts] #73984: pango at 1.57.1: build fails with Apple clang 21 — comma-separated -Werror specifier rejected
MacPorts
- [MacPorts] #65492: webkit2-gtk update?
MacPorts
- [MacPorts] #73986: llama.cpp @ v9102 installs unit test binaries
MacPorts
- [MacPorts] #73987: nodejs24: where is npm??
MacPorts
- [MacPorts] #73987: nodejs24: where is npm??
MacPorts
- [MacPorts] #73988: btop @1.4.7 does not build on macOS Sonoma 14.8.5 because src/btop_config.cpp:819:24: error: constexpr function's return type 'std::optional<fs::path>' is not a literal type
MacPorts
- [MacPorts] #73988: btop @1.4.7 does not build on macOS Sonoma 14.8.5 because src/btop_config.cpp:819:24: error: constexpr function's return type 'std::optional<fs::path>' is not a literal type
MacPorts
- [MacPorts] #65492: webkit2-gtk update?
MacPorts
- [MacPorts] #65492: webkit2-gtk update?
MacPorts
- Re: [MacPorts] #73984: pango at 1.57.1: build fails with Apple clang 21 — comma-separated -Werror specifier rejected
MacPorts
- Re: [MacPorts] #73984: pango at 1.57.1: build fails with Apple clang 21 — comma-separated -Werror specifier rejected
MacPorts
- [MacPorts] #73987: nodejs24: where is npm??
MacPorts
- [MacPorts] #73986: llama.cpp @ v9102 installs unit test binaries
MacPorts
- [MacPorts] #73989: incorrect post-install notes
MacPorts
- [MacPorts] #73989: mise: incorrect post-install notes (was: incorrect post-install notes)
MacPorts
- [MacPorts] #72445: sc @7.16_3: compilation fails
MacPorts
- [MacPorts] #73990: Request new package: mongocli
MacPorts
- [MacPorts] #73828: Duplicated code in test files
MacPorts
- [MacPorts] #73827: There are multiple sources.conf files
MacPorts
- [MacPorts] #73893: Homebank fails to start
MacPorts
- [MacPorts] #73893: Homebank fails to start
MacPorts
- [MacPorts] #73991: grass assumes symbols in OpenGL which may not exist, which breaks the build
MacPorts
- [MacPorts] #73980: yfinance installs a generic-name binary that fails to run: ModuleNotFoundError: No module named 'sample'
MacPorts
- [MacPorts] #73992: yt-dlp version: 2026.03.17 category: net (update to 2026.05.05 nightly)
MacPorts
- [MacPorts] #65492: webkit2-gtk update?
MacPorts
- [MacPorts] #73993: rocksdb: build failure
MacPorts
- [MacPorts] #73993: rocksdb: build failure
MacPorts
- [MacPorts] #65492: webkit2-gtk update?
MacPorts
- [MacPorts] #73993: rocksdb: build failure
MacPorts
- [MacPorts] #73993: rocksdb: build failure
MacPorts
- [MacPorts] #65492: webkit2-gtk update?
MacPorts
- [MacPorts] #73994: netgen fails to build with clangs on Catalina and below: error: member reference base type 'MakeSimdCl' is not a structure or union
MacPorts
- [MacPorts] #73987: nodejs24: where is npm??
MacPorts
- [MacPorts] #73995: deno: improve compatibility
MacPorts
- [MacPorts] #73996: mlx @0.31.2_0: build failure “due to missing Metal Toolchain”... but it exists.
MacPorts
- Re: [MacPorts] #73996: mlx @0.31.2_0: build failure “due to missing Metal Toolchain”... but it exists.
MacPorts
- [MacPorts] #73997: hivex @1.3.24_1: hivexregedit missing because perl can't be enabled
MacPorts
- Re: [MacPorts] #73996: mlx @0.31.2_0: build failure “due to missing Metal Toolchain”... but it exists.
MacPorts
- [MacPorts] #73997: hivex @1.3.24_1: hivexregedit missing because perl can't be enabled
MacPorts
- [MacPorts] #73998: gambit-c errors on 32-bit: cc1(10863) malloc: *** mmap(size=16777216) failed (error code=12)
MacPorts
- [MacPorts] #73999: netgen @6.2.2604 fails to build with gcc: error: no matching function for call to 'std::basic_string<char>::erase(__gnu_cxx::__normal_iterator<char*, std::basic_string<char> >, std::basic_string<char>::const_iterator)'
MacPorts
- Re: [MacPorts] #73996: mlx @0.31.2_0: build failure “due to missing Metal Toolchain”... but it exists.
MacPorts
- [MacPorts] #73966: gnutls @3.8.13: compiling from source code freezes on macOS 10.8
MacPorts
- [MacPorts] #65492: webkit2-gtk update?
MacPorts
- Re: [MacPorts] #73996: mlx @0.31.2_0: build failure “due to missing Metal Toolchain”... but it exists.
MacPorts
- Re: [MacPorts] #73996: mlx @0.31.2_0: build failure “due to missing Metal Toolchain”... but it exists.
MacPorts
- Re: [MacPorts] #73996: mlx @0.31.2_0: build failure “due to missing Metal Toolchain”... but it exists.
MacPorts
- Re: [MacPorts] #73996: mlx @0.31.2_0: build failure “due to missing Metal Toolchain”... but it exists.
MacPorts
- [MacPorts] #74000: Graphviz @12.2.1does not build on macOS High Sierra, Version 10.13.6, because of Error: Requested variants "+pangocairo+x11" do not match those the build was started with: "+gdk_pixbuf+pangocairo+poppler+rsvg+x11"
MacPorts
- [MacPorts] #74000: Graphviz @12.2.1does not build on macOS High Sierra, Version 10.13.6, because of Error: Requested variants "+pangocairo+x11" do not match those the build was started with: "+gdk_pixbuf+pangocairo+poppler+rsvg+x11"
MacPorts
- [MacPorts] #74000: Graphviz @12.2.1does not build on macOS High Sierra, Version 10.13.6, because of Error: Requested variants "+pangocairo+x11" do not match those the build was started with: "+gdk_pixbuf+pangocairo+poppler+rsvg+x11"
MacPorts
- [MacPorts] #72444: xine-lib build fails: incompatible function pointer types
MacPorts
- [MacPorts] #71697: multiple ports: vala is specified as lib dependency rather than build dependency
MacPorts
- [MacPorts] #71864: gegl: patch fails to apply when building with gcc (yes, again)
MacPorts
- [MacPorts] #65492: webkit2-gtk update?
MacPorts
- Re: [MacPorts] #73996: mlx @0.31.2_0: build failure “due to missing Metal Toolchain”... but it exists.
MacPorts
- [MacPorts] #74000: Graphviz @12.2.1does not build on macOS High Sierra, Version 10.13.6, because of Error: Requested variants "+pangocairo+x11" do not match those the build was started with: "+gdk_pixbuf+pangocairo+poppler+rsvg+x11"
MacPorts
- [MacPorts] #74001: transmission-qt @2.94_1 build fails with size_t unknown type error
MacPorts
- [MacPorts] #74001: transmission-qt @2.94_1 build fails with size_t unknown type error
MacPorts
- [MacPorts] #73594: xorg-server @1.20.11_1: Problem displaying x11 windows in Tahoe
MacPorts
- [MacPorts] #64801: Update request for py-healpy to v1.15.2
MacPorts
- [MacPorts] #74001: transmission-qt @2.94_1 build fails with size_t unknown type error
MacPorts
- [MacPorts] #73594: xorg-server @1.20.11_1: Problem displaying x11 windows in Tahoe
MacPorts
- [MacPorts] #74002: icu @78.3_1: fails to upgrade on x86_64 Tahoe with: configure: error: Python failed to run: ValueError: source code string cannot contain null bytes
MacPorts
- [MacPorts] #74002: icu @78.3_1: fails to upgrade on x86_64 Tahoe with: configure: error: Python failed to run: ValueError: source code string cannot contain null bytes
MacPorts
- [MacPorts] #62216: db53 @5.3.28: error: Support for FCNTL mutexes was removed in BDB 4.8.
MacPorts
- [MacPorts] #71269: valgrind-macos-devel @3.22.0-r2023-10-29: configure: error: Valgrind works on Darwin 10.x-23.x (Mac OS X 10.6-10.11 and macOS 10.12-14.0)
MacPorts
- [MacPorts] #26017: aqualess-1.6 AquaLess.app ignores set UTF-8 locale and thus does not display correctly UTF-8 encoded text
MacPorts
- [MacPorts] #74003: xorg-server @1.20.11_1, mesa @26.0.7_0+llvmpipe: Indirect GLX is not working on macOS Tahoe 26.5
MacPorts
- Re: [MacPorts] #73984: pango at 1.57.1: build fails with Apple clang 21 — comma-separated -Werror specifier rejected
MacPorts
- Re: [MacPorts] #73984: pango at 1.57.1: build fails with Apple clang 21 — comma-separated -Werror specifier rejected
MacPorts
- Re: [MacPorts] #73984: pango at 1.57.1: build fails with Apple clang 21 — comma-separated -Werror specifier rejected
MacPorts
- Re: [MacPorts] #73984: pango at 1.57.1: build fails with Apple clang 21 — comma-separated -Werror specifier rejected
MacPorts
- [MacPorts] #73987: nodejs24: where is npm??
MacPorts
- [MacPorts] #74004: Error compiling PDAL 2.10.1
MacPorts
- [MacPorts] #74004: Error compiling PDAL 2.10.1
MacPorts
- [MacPorts] #74004: pdal @2.10.1_0 Error compiling (was: Error compiling PDAL 2.10.1)
MacPorts
- [MacPorts] #74004: pdal @2.10.1_0 Error compiling
MacPorts
- [MacPorts] #73987: nodejs24: where is npm??
MacPorts
- [MacPorts] #73987: nodejs24: where is npm??
MacPorts
- [MacPorts] #74004: pdal @2.10.1_0 Error compiling
MacPorts
- [MacPorts] #73990: Request new package: mongocli
MacPorts
- [MacPorts] #74000: Graphviz @12.2.1does not build on macOS High Sierra, Version 10.13.6, because of Error: Requested variants "+pangocairo+x11" do not match those the build was started with: "+gdk_pixbuf+pangocairo+poppler+rsvg+x11"
MacPorts
- [MacPorts] #74000: Graphviz @12.2.1does not build on macOS High Sierra, Version 10.13.6, because of Error: Requested variants "+pangocairo+x11" do not match those the build was started with: "+gdk_pixbuf+pangocairo+poppler+rsvg+x11"
MacPorts
- [MacPorts] #74005: Is there not a port for the 'at' utility in MacPorts?
MacPorts
- [MacPorts] #74004: pdal @2.10.1_0 Error compiling
MacPorts
- [MacPorts] #74005: Is there not a port for the 'at' utility in MacPorts?
MacPorts
- [MacPorts] #69924: opencv3: update to 3.4.20
MacPorts
- [MacPorts] #69924: opencv3: update to 3.4.20
MacPorts
- [MacPorts] #73986: llama.cpp @ v9102 installs unit test binaries
MacPorts
- [MacPorts] #63572: virt-viewer needs INTLTOOL_PERL fix
MacPorts
- [MacPorts] #59491: emergent @5.3.7: Found unsuitable Qt version "" from NOTFOUND, this code requires Qt 4.x
MacPorts
- [MacPorts] #59491: emergent @5.3.7: Found unsuitable Qt version "" from NOTFOUND, this code requires Qt 4.x
MacPorts
- [MacPorts] #71269: valgrind-macos-devel @3.22.0-r2023-10-29: configure: error: Valgrind works on Darwin 10.x-23.x (Mac OS X 10.6-10.11 and macOS 10.12-14.0)
MacPorts
- [MacPorts] #73034: emacs +x11 under Tahoe 26.0 has a black bar covering menu
MacPorts
- [MacPorts] #62087: wxWidgets-3.2 fails on 10.11 and earlier
MacPorts
- [MacPorts] #73414: emacs @30.2: opportunistic use of lcms2
MacPorts
- [MacPorts] #71850: emacs-app @29.4: dyld: lazy symbol binding failed: Symbol not found: _clock_gettime
MacPorts
- [MacPorts] #68179: emacs @29.1_1: Symbol not found: _clock_gettime
MacPorts
- [MacPorts] #70022: emacs @29.3: Symbol not found: _clock_gettime
MacPorts
- [MacPorts] #56423: emacs-devel @20170918 as X client cannot be used with recent fontconfig @2.13.0_0 and non-C locale
MacPorts
- [MacPorts] #74006: gpac symbols missing in libavcodec after ffmpeg8.1 update
MacPorts
- [MacPorts] #74006: gpac symbols missing in libavcodec after ffmpeg8.1 update
MacPorts
- [MacPorts] #70363: moc: can never get to run because of jack issues
MacPorts
- [MacPorts] #69833: nethack343: Livecheck is wrong
MacPorts
- [MacPorts] #73312: nethack: missing bison build dependency
MacPorts
- [MacPorts] #69831: nethack: enable curses graphics
MacPorts
- [MacPorts] #73712: qt513-qtbase @5.13.2_13+openssl: several errors
MacPorts
- [MacPorts] #73639: ccache @4.13.1_0+doc: no member named 'ranges' in namespace 'std'
MacPorts
- [MacPorts] #74006: gpac symbols missing in libavcodec after ffmpeg8.1 update
MacPorts
- [MacPorts] #73627: clang_select-22 doesn't install bin/c-index-test-mp-22
MacPorts
- [MacPorts] #73627: clang_select-22 doesn't install bin/c-index-test-mp-22
MacPorts
- [MacPorts] #73639: ccache @4.13.1_0+doc: no member named 'ranges' in namespace 'std'
MacPorts
- [MacPorts] #73754: pandoc @3.9.0.2_0: fails to build if gcc is installed
MacPorts
- [MacPorts] #74006: gpac symbols missing in libavcodec after ffmpeg8.1 update
MacPorts
- [MacPorts] #74007: py-asn1 is ambiguously named
MacPorts
- [MacPorts] #74008: emacs-app @30.2_7 errors out when calling libgccjit
MacPorts
- [MacPorts] #63491: libopenshot: error: use of undeclared identifier 'zmq_ctx_shutdown'
MacPorts
- [MacPorts] #74008: emacs-app @30.2_7 errors out when calling libgccjit
MacPorts
- [MacPorts] #74008: emacs-app @30.2_7 errors out when calling libgccjit
MacPorts
- [MacPorts] #74009: py-cachetools fails to install/upgrade when 'setuptools-scm' is missing
MacPorts
- [MacPorts] #74010: spyder-313: crashes with a generic looking python error
MacPorts
- [MacPorts] #69655: libopenshot @0.3.2: Undefined symbols
MacPorts
- [MacPorts] #73754: pandoc @3.9.0.2_0: fails to build if gcc is installed
MacPorts
- [MacPorts] #73535: ghc @9.14.1_1 (+prebuilt) has issues on MacOS 15.7.1 when building cabal
MacPorts
- [MacPorts] #74009: py-cachetools fails to install/upgrade when 'setuptools-scm' is missing
MacPorts
- [MacPorts] #74010: spyder-313: crashes with a generic looking python error
MacPorts
- [MacPorts] #73966: gnutls @3.8.13: compiling from source code freezes on macOS 10.8
MacPorts
- [MacPorts] #73966: gnutls @3.8.13: compiling from source code freezes on macOS 10.8
MacPorts
- [MacPorts] #72398: mjpegtools: error: no member named 'DoesContainPoint' in 'Region2D<INDEX, SIZE>'
MacPorts
- [MacPorts] #58635: scalapack @2.02+gcc9+openmpi+openblas: error: expected expression before '_Static_assert'
MacPorts
- [MacPorts] #73966: gnutls @3.8.13: compiling from source code freezes on macOS 10.8
MacPorts
- [MacPorts] #72356: lha @20211125_0: header.c:71:13: error: parameter 'len' was not declared, defaults to 'int'; ISO C99 and later do not support implicit int [-Wimplicit-int]
MacPorts
- [MacPorts] #71702: mariadb-10.11 install fails on Sequoia 15.2
MacPorts
- [MacPorts] #72752: mariadb-11.4: Wrong installation notes
MacPorts
- [MacPorts] #72779: MariaDB: Please import MariaDB 11.8 LTS series
MacPorts
- [MacPorts] #61696: transcode @1.1.7: error: implicit declaration of function 'audio_resample_close' is invalid in C99
MacPorts
- [MacPorts] #74011: texlive-bin-2026.7823 after build fails staging on Tahoe x86 + workaround
MacPorts
- [MacPorts] #71697: multiple ports: vala is specified as lib dependency rather than build dependency
MacPorts
- [MacPorts] #74012: qt513-qtbase @5.13.2_14+openssl: Fails to build
MacPorts
- [MacPorts] #74012: qt513-qtbase @5.13.2_14+openssl: Fails to build
MacPorts
- [MacPorts] #74012: qt513-qtbase @5.13.2_14+openssl: Fails to build
MacPorts
- [MacPorts] #73712: qt513-qtbase @5.13.2_13+openssl: several errors
MacPorts
- [MacPorts] #74011: texlive-bin-2026.7823 after build fails staging on Tahoe x86 + workaround
MacPorts
- [MacPorts] #63392: doxygen @1.9.2: CMake Error: Unknown argument -EPSTOPDF=/opt/local/bin/epstopdf
MacPorts
- [MacPorts] #60792: rsync: re-enable HFS compression
MacPorts
- [MacPorts] #73607: mas: Restrict to supported OS versions
MacPorts
- [MacPorts] #74013: mas: mas port lacks man page and wrapper shell script
MacPorts
- [MacPorts] #68733: doxygen, doxygen-devel: does not respect python setting, picking a newer python if available
MacPorts
- [MacPorts] #73344: doxygen 1.14.0: needs an update to 1.15 to fix GitHub 11679
MacPorts
- [MacPorts] #74014: ollama @0.24.0_0+completion+mlx cannot load mlx models
MacPorts
- [MacPorts] #74014: ollama @0.24.0_0+completion+mlx cannot load mlx models
MacPorts
- [MacPorts] #74013: mas: mas port lacks man page and wrapper shell script
MacPorts
- [MacPorts] #73283: bash @5.3.3 segmentation faults
MacPorts
- [MacPorts] #72910: aircraft_oap @3.1.0 wants homebrew (?!): FileNotFoundError: [Errno 2] No such file or directory: 'brew':
MacPorts
- [MacPorts] #72250: alliance: {standard input}:441:non-relocatable subtraction expression, "_FBL_DCRHED" minus "L00000000002$pb"
MacPorts
- [MacPorts] #45556: alliance @5.0-20110203_2: error: reference to 'hash' is ambiguous
MacPorts
- [MacPorts] #42030: alliance @5.0: error: incompatible type for argument 2 of 'chktab'
MacPorts
- [MacPorts] #69420: geomview @1.9.5_0+opengl: error: expected identifier or '('
MacPorts
- [MacPorts] #45612: SoXt @1.2.2: Undefined symbols _glXChooseVisual _glXCreateContext _glXGetCurrentContext _glXIsDirect _glXMakeCurrent _glXSwapBuffers
MacPorts
- [MacPorts] #74015: please enable the GDC compiler (past of gcc) for arm64
MacPorts
- [MacPorts] #74015: please enable the GDC compiler (part of gcc) for arm64 (D-lang) (was: please enable the GDC compiler (past of gcc) for arm64)
MacPorts
- [MacPorts] #74015: please enable the GDC compiler (part of gcc) for arm64 (D-lang)
MacPorts
- [MacPorts] #74016: glib2 @2.88.1_0 +quartz fails to build on MacOS 15.7.7
MacPorts
- [MacPorts] #74016: glib2 @2.88.1_0 +quartz fails to build on MacOS 15.7.7
MacPorts
- [MacPorts] #74017: qt6-qtwebengine fails on staging
MacPorts
- [MacPorts] #74017: qt6-qtwebengine fails on staging
MacPorts
- [MacPorts] #74018: py-uritools fails to install/upgrade when 'setuptools-scm' is missing
MacPorts
- [MacPorts] #74019: Can't install the port because it's missing in every mirror
MacPorts
- [MacPorts] #74019: Can't install the port because it's missing in every mirror
MacPorts
- [MacPorts] #74008: emacs-app @30.2_7 errors out when calling libgccjit
MacPorts
- [MacPorts] #74014: ollama @0.24.0_0+completion+mlx cannot load mlx models
MacPorts
- [MacPorts] #74019: Can't install the port because it's missing in every mirror
MacPorts
- [MacPorts] #74008: emacs-app @30.2_7 errors out when calling libgccjit
MacPorts
- [MacPorts] #74019: Can't install the port because it's missing in every mirror
MacPorts
- [MacPorts] #74018: py-uritools fails to install/upgrade when 'setuptools-scm' is missing
MacPorts
- [MacPorts] #74017: qt6-qtwebengine fails on staging
MacPorts
- [MacPorts] #74017: qt6-qtwebengine fails on staging
MacPorts
- [MacPorts] #74017: qt6-qtwebengine fails on staging
MacPorts
- [MacPorts] #74017: qt6-qtwebengine fails on staging
MacPorts
- [MacPorts] #74016: glib2 @2.88.1_0 +quartz fails to build on MacOS 15.7.7
MacPorts
- [MacPorts] #74016: glib2 @2.88.1_0 +quartz fails to build on MacOS 15.7.7
MacPorts
- [MacPorts] #74020: alliance fails to build: ./elp_y.y: error: parameter name omitted
MacPorts
- [MacPorts] #74017: qt6-qtwebengine fails on staging
MacPorts
- [MacPorts] #74021: arb fails to configure, not being aware of modern compilers: Your compiler is 'gcc' version '14.3.0': This version is not in the list of supported gcc-versions:
MacPorts
- [MacPorts] #74016: glib2 @2.88.1_0 +quartz fails to build on MacOS 15.7.7
MacPorts
- [MacPorts] #73958: gstreamer1-gst-plugins-bad @1.28.2_1 error: unrecognized platform name visionos (macOS < 13)
MacPorts
- [MacPorts] #74010: spyder-313: crashes with a generic looking python error
MacPorts
- [MacPorts] #74017: qt6-qtwebengine fails on staging
MacPorts
- [MacPorts] #74014: ollama @0.24.0_0+completion+mlx cannot load mlx models
MacPorts
- [MacPorts] #74014: ollama @0.24.0_0+completion+mlx cannot load mlx models
MacPorts
- [MacPorts] #74014: ollama @0.24.0_0+completion+mlx cannot load mlx models
MacPorts
- [MacPorts] #74014: ollama @0.24.0_0+completion+mlx cannot load mlx models
MacPorts
- [MacPorts] #74022: OpenBLAS @0.3.32+gcc15+lapack+native: Clang misoptimization leads to SIGILL
MacPorts
- [MacPorts] #74022: OpenBLAS @0.3.32+gcc15+lapack+native: Clang misoptimization leads to SIGILL
MacPorts
- [MacPorts] #74023: Port request: MiddleClick
MacPorts
- [MacPorts] #74010: spyder-313: crashes with a generic looking python error
MacPorts
- [MacPorts] #74024: When Port install p5.34-html-parser, there is no resouce
MacPorts
- [MacPorts] #74024: When Port install p5.34-html-parser, there is no resouce
MacPorts
- [MacPorts] #73966: gnutls @3.8.13: compiling from source code freezes on macOS 10.8
MacPorts
- [MacPorts] #74010: spyder-313: crashes with a generic looking python error
MacPorts
- [MacPorts] #74025: harfbuzz-14.2.0 does not build on PPC Leopard, Mac OS X 10.5.8, because of error: 'CTFontManagerCreateFontDescriptorsFromURL' was not declared in this scope
MacPorts
- [MacPorts] #74025: harfbuzz-14.2.0 does not build on PPC Leopard, Mac OS X 10.5.8, because of error: 'CTFontManagerCreateFontDescriptorsFromURL' was not declared in this scope
MacPorts
- [MacPorts] #74024: When Port install p5.34-html-parser, there is no resouce
MacPorts
- [MacPorts] #74024: When Port install p5.34-html-parser, there is no resouce
MacPorts
- [MacPorts] #74024: When Port install p5.34-html-parser, there is no resouce
MacPorts
- [MacPorts] #74025: harfbuzz-14.2.0 does not build on PPC Leopard, Mac OS X 10.5.8, because of error: 'CTFontManagerCreateFontDescriptorsFromURL' was not declared in this scope
MacPorts
- [MacPorts] #74025: harfbuzz-14.2.0 does not build on PPC Leopard, Mac OS X 10.5.8, because of error: 'CTFontManagerCreateFontDescriptorsFromURL' was not declared in this scope
MacPorts
- [MacPorts] #74025: harfbuzz-14.2.0 does not build on PPC Leopard, Mac OS X 10.5.8, because of error: 'CTFontManagerCreateFontDescriptorsFromURL' was not declared in this scope
MacPorts
- [MacPorts] #74026: gmic-qt fails: Version numbers of files 'gmic.h' (376) and 'CImg.h' (377) mismatch
MacPorts
- [MacPorts] #74026: gmic-qt fails: Version numbers of files 'gmic.h' (376) and 'CImg.h' (377) mismatch
MacPorts
- [MacPorts] #74024: When Port install p5.34-html-parser, there is no resouce
MacPorts
- [MacPorts] #74026: gmic-qt fails: Version numbers of files 'gmic.h' (376) and 'CImg.h' (377) mismatch
MacPorts
- [MacPorts] #73535: ghc @9.14.1_1 (+prebuilt) has issues on MacOS 15.7.1 when building cabal
MacPorts
- [MacPorts] #73754: pandoc @3.9.0.2_0: fails to build if gcc is installed
MacPorts
- [MacPorts] #73754: pandoc @3.9.0.2_0: fails to build if gcc is installed
MacPorts
- [MacPorts] #74026: gmic-qt fails: Version numbers of files 'gmic.h' (376) and 'CImg.h' (377) mismatch
MacPorts
- [MacPorts] #74026: gmic-qt fails: Version numbers of files 'gmic.h' (376) and 'CImg.h' (377) mismatch
MacPorts
- [MacPorts] #74025: harfbuzz-14.2.0 does not build on PPC Leopard, Mac OS X 10.5.8, because of error: 'CTFontManagerCreateFontDescriptorsFromURL' was not declared in this scope
MacPorts
- [MacPorts] #74010: spyder-313: crashes with a generic looking python error
MacPorts
- [MacPorts] #74024: When Port install p5.34-html-parser, there is no resouce
MacPorts
- [MacPorts] #74027: qt6-qtbase @6.11.1_1: fatal error: headers not found
MacPorts
- [MacPorts] #74027: qt6-qtbase @6.11.1_1: fatal error: headers not found
MacPorts
- [MacPorts] #74028: nss-3.124 does not build on PPC Mac OS X 10.5.8, Leopard, because error: mm_malloc.h: No such file or directory
MacPorts
- [MacPorts] #74028: nss-3.124 does not build on PPC Mac OS X 10.5.8, Leopard, because error: mm_malloc.h: No such file or directory
MacPorts
- [MacPorts] #74026: gmic-qt fails: Version numbers of files 'gmic.h' (376) and 'CImg.h' (377) mismatch
MacPorts
- [MacPorts] #74028: nss-3.124 does not build on PPC Mac OS X 10.5.8, Leopard, because error: mm_malloc.h: No such file or directory
MacPorts
- [MacPorts] #74028: nss-3.124 does not build on PPC Mac OS X 10.5.8, Leopard, because error: mm_malloc.h: No such file or directory
MacPorts
- [MacPorts] #74010: spyder-313: crashes with a generic looking python error
MacPorts
- [MacPorts] #74025: harfbuzz-14.2.0 does not build on PPC Leopard, Mac OS X 10.5.8, because of error: 'CTFontManagerCreateFontDescriptorsFromURL' was not declared in this scope
MacPorts
- [MacPorts] #74025: harfbuzz-14.2.0 does not build on PPC Leopard, Mac OS X 10.5.8, because of error: 'CTFontManagerCreateFontDescriptorsFromURL' was not declared in this scope
MacPorts
- [MacPorts] #73535: ghc @9.14.1_1 (+prebuilt) has issues on MacOS 15.7.1 when building cabal
MacPorts
- [MacPorts] #73535: ghc @9.14.1_1 (+prebuilt) has issues on MacOS 15.7.1 when building cabal
MacPorts
- [MacPorts] #74029: ghc @9.14.1_2: build failure: Undefined symbols: _libiconv
MacPorts
- [MacPorts] #74030: nqc: build fails on Apple Silicon (arm64) with two source bugs
MacPorts
- [MacPorts] #73754: pandoc @3.9.0.2_0: fails to build if gcc is installed
MacPorts
- [MacPorts] #74025: harfbuzz-14.2.0 does not build on PPC Leopard, Mac OS X 10.5.8, because of error: 'CTFontManagerCreateFontDescriptorsFromURL' was not declared in this scope
MacPorts
- [MacPorts] #74025: harfbuzz-14.2.0 does not build on PPC Leopard, Mac OS X 10.5.8, because of error: 'CTFontManagerCreateFontDescriptorsFromURL' was not declared in this scope
MacPorts
- [MacPorts] #74029: ghc @9.14.1_2: build failure: Undefined symbols: _libiconv
MacPorts
- [MacPorts] #74024: When Port install p5.34-html-parser, there is no resouce
MacPorts
- [MacPorts] #74019: Can't install the port because it's missing in every mirror
MacPorts
- [MacPorts] #74028: nss-3.124 does not build on PPC Mac OS X 10.5.8, Leopard, because error: mm_malloc.h: No such file or directory
MacPorts
- [MacPorts] #74030: nqc: build fails on Apple Silicon (arm64) with two source bugs
MacPorts
- [MacPorts] #74022: OpenBLAS @0.3.32+gcc15+lapack+native: Clang misoptimization leads to SIGILL
MacPorts
- [MacPorts] #26017: aqualess-1.6 AquaLess.app ignores set UTF-8 locale and thus does not display correctly UTF-8 encoded text
MacPorts
- [MacPorts] #73754: pandoc @3.9.0.2_0: fails to build if gcc is installed
MacPorts
- [MacPorts] #74031: ghc @9.14.1_2 build fails
MacPorts
- [MacPorts] #74031: ghc @9.14.1_2 build fails
MacPorts
- [MacPorts] #73754: pandoc @3.9.0.2_0: fails to build if gcc is installed
MacPorts
- [MacPorts] #74031: ghc @9.14.1_2 build fails
MacPorts
- [MacPorts] #73754: pandoc @3.9.0.2_0: fails to build if gcc is installed
MacPorts
- [MacPorts] #74031: ghc @9.14.1_2 build fails
MacPorts
- [MacPorts] #74025: harfbuzz-14.2.0 does not build on PPC Leopard, Mac OS X 10.5.8, because of error: 'CTFontManagerCreateFontDescriptorsFromURL' was not declared in this scope
MacPorts
- [MacPorts] #73754: pandoc @3.9.0.2_0: fails to build if gcc is installed
MacPorts
- [MacPorts] #74025: harfbuzz-14.2.0 does not build on PPC Leopard, Mac OS X 10.5.8, because of error: 'CTFontManagerCreateFontDescriptorsFromURL' was not declared in this scope
MacPorts
- [MacPorts] #74032: ghc at 9.14.1_2 fails to build from source, arm64
MacPorts
- [MacPorts] #74032: ghc at 9.14.1_2 fails to build from source, arm64
MacPorts
- [MacPorts] #74033: Poppler -- Unable to Configure -- unrecognized argument in option '-stdlib=macports-libstdc++'
MacPorts
- [MacPorts] #74033: Poppler -- Unable to Configure -- unrecognized argument in option '-stdlib=macports-libstdc++'
MacPorts
- [MacPorts] #64269: lscsoft-deps +lalsuite: Error: No such port: py27-astropy py27-h5py py27-healpy py27-shapely
MacPorts
- [MacPorts] #73754: pandoc @3.9.0.2_0: fails to build if gcc is installed
MacPorts
- [MacPorts] #73754: pandoc @3.9.0.2_0: fails to build if gcc is installed
MacPorts
- [MacPorts] #73754: pandoc @3.9.0.2_0: fails to build if gcc is installed
MacPorts
- [MacPorts] #73754: pandoc @3.9.0.2_0: fails to build if gcc is installed
MacPorts
- [MacPorts] #73754: pandoc @3.9.0.2_0: fails to build if gcc is installed
MacPorts
- [MacPorts] #74034: pandoc @3.9.0.2_1: fails to build if gcc is installed
MacPorts
- [MacPorts] #74034: pandoc @3.9.0.2_1: fails to build if gcc is installed
MacPorts
- [MacPorts] #74035: dvisvgm-3.6 does not build on PPC Leopard, Mac OS X 10.5.8, because of configure not finding kpathsea/kpathsea.h
MacPorts
- [MacPorts] #74035: dvisvgm-3.6 does not build on PPC Leopard, Mac OS X 10.5.8, because of configure not finding kpathsea/kpathsea.h
MacPorts
- [MacPorts] #74035: dvisvgm-3.6 does not build on PPC Leopard, Mac OS X 10.5.8, because of configure not finding kpathsea/kpathsea.h
MacPorts
- [MacPorts] #65623: ffmpeg: update to 8.x
MacPorts
- [MacPorts] #74035: dvisvgm-3.6 does not build on PPC Leopard, Mac OS X 10.5.8, because of configure not finding kpathsea/kpathsea.h
MacPorts
- [MacPorts] #74036: php82 php-8.2.30
MacPorts
- [MacPorts] #74036: php82 php-8.2.30
MacPorts
- [MacPorts] #74032: ghc at 9.14.1_2 fails to build from source, arm64
MacPorts
- [MacPorts] #74029: ghc @9.14.1_2: build failure: Undefined symbols: _libiconv
MacPorts
- [MacPorts] #74035: dvisvgm-3.6 does not build on PPC Leopard, Mac OS X 10.5.8, because of configure not finding kpathsea/kpathsea.h
MacPorts
- [MacPorts] #74035: dvisvgm-3.6 does not build on PPC Leopard, Mac OS X 10.5.8, because of configure not finding kpathsea/kpathsea.h
MacPorts
- [MacPorts] #74037: luametatex @2.11.08 does not build on PPC Leopard, Mac OS X 10.5.8, because of ld: unknown option: -z
MacPorts
- [MacPorts] #74037: luametatex @2.11.08 does not build on PPC Leopard, Mac OS X 10.5.8, because of ld: unknown option: -z
MacPorts
- [MacPorts] #74036: php82 @8.2.30_1 build failure (was: php82 php-8.2.30)
MacPorts
- [MacPorts] #74036: php82 @8.2.30_1 build failure
MacPorts
- [MacPorts] #73992: yt-dlp version: 2026.03.17 category: net (update to 2026.05.05 nightly)
MacPorts
- [MacPorts] #73712: qt513-qtbase @5.13.2_13+openssl: several errors
MacPorts
- [MacPorts] #73468: openjdk21-temurin @21.0.10_0: broken
MacPorts
- [MacPorts] #73712: qt513-qtbase @5.13.2_13+openssl: several errors
MacPorts
- [MacPorts] #72204: luametatex @2.11.07 fails to build: error: /opt/local/bin/strip: unrecognized option: -g
MacPorts
- [MacPorts] #74037: luametatex @2.11.08 does not build on PPC Leopard, Mac OS X 10.5.8, because of ld: unknown option: -z
MacPorts
- [MacPorts] #74037: luametatex @2.11.08 does not build on PPC Leopard, Mac OS X 10.5.8, because of ld: unknown option: -z
MacPorts
- [MacPorts] #74036: php82 @8.2.30_1 build failure
MacPorts
- [MacPorts] #74038: Please create a port for libltdl
MacPorts
- [MacPorts] #74038: Please create a port for libltdl
MacPorts
- [MacPorts] #74038: Please create a port for libltdl
MacPorts
- [MacPorts] #74022: OpenBLAS @0.3.32+gcc15+lapack+native: Clang misoptimization leads to SIGILL
MacPorts
- [MacPorts] #73896: jdupes @1.31.1 does not build on macOS High Sierra, Version 10.13.6, because of: act_linkfiles.c:365:23: error: label at end of compound statement: expected statement
MacPorts
- [MacPorts] #74039: x265 @4.2 does not build on PPC Leopard, Mac OS X 10.5.8, because of Undefined symbols
MacPorts
- [MacPorts] #74039: x265 @4.2 does not build on PPC Leopard, Mac OS X 10.5.8, because of Undefined symbols
MacPorts
- [MacPorts] #74035: dvisvgm-3.6 does not build on PPC Leopard, Mac OS X 10.5.8, because of configure not finding kpathsea/kpathsea.h
MacPorts
- [MacPorts] #74025: harfbuzz-14.2.0 does not build on PPC Leopard, Mac OS X 10.5.8, because of error: 'CTFontManagerCreateFontDescriptorsFromURL' was not declared in this scope
MacPorts
- [MacPorts] #74031: ghc @9.14.1_2 build fails
MacPorts
- [MacPorts] #74038: Please create a port for libltdl
MacPorts
- [MacPorts] #74038: Please create a port for libltdl
MacPorts
- [MacPorts] #74038: Please create a port for libltdl
MacPorts
- [MacPorts] #74040: arm64 build machine is offline
MacPorts
- [MacPorts] #74035: dvisvgm-3.6 does not build on PPC Leopard, Mac OS X 10.5.8, because of configure not finding kpathsea/kpathsea.h
MacPorts
- [MacPorts] #74041: opendx @4.4.4: patch fails
MacPorts
- [MacPorts] #74031: ghc @9.14.1_2 build fails
MacPorts
- [MacPorts] #74030: nqc: build fails on Apple Silicon (arm64) with two source bugs
MacPorts
- [MacPorts] #74021: arb fails to configure, not being aware of modern compilers: Your compiler is 'gcc' version '14.3.0': This version is not in the list of supported gcc-versions:
MacPorts
- [MacPorts] #70098: arb @6.0.6: This version is not in the list of supported gcc-versions
MacPorts
- [MacPorts] #74007: py-asn1 is ambiguously named
MacPorts
- [MacPorts] #74002: icu @78.3_1: fails to upgrade on x86_64 Tahoe with: configure: error: Python failed to run: ValueError: source code string cannot contain null bytes
MacPorts
- [MacPorts] #73987: nodejs24: where is npm??
MacPorts
- [MacPorts] #74038: Please create a port for libltdl
MacPorts
- [MacPorts] #73969: glib2 error
MacPorts
- [MacPorts] #74040: arm64 build machine is offline
MacPorts
- [MacPorts] #74042: With the update to GRASS 8.5, the GRASS algorithms are no longer available in QGIS 3
MacPorts
- [MacPorts] #74038: Please create a port for libltdl
MacPorts
- [MacPorts] #74002: icu @78.3_1: fails to upgrade on x86_64 Tahoe with: configure: error: Python failed to run: ValueError: source code string cannot contain null bytes
MacPorts
- [MacPorts] #74002: icu @78.3_1: fails to upgrade on x86_64 Tahoe with: configure: error: Python failed to run: ValueError: source code string cannot contain null bytes
MacPorts
- [MacPorts] #74002: icu @78.3_1: fails to upgrade on x86_64 Tahoe with: configure: error: Python failed to run: ValueError: source code string cannot contain null bytes
MacPorts
- [MacPorts] #74042: grass, qgis3: after update to grass 8.5, the GRASS algorithms are no longer available in qgis3 (was: With the update to GRASS 8.5, the GRASS algorithms are no longer available in QGIS 3)
MacPorts
- [MacPorts] #74043: texlive-bin @2025.74524_1 does not rebuild on PPC Leopard, Mac OS X 10.5.8, because TeX Live sources redefine getopt() and getenv() and in pTeX a variable is named "bool"!
MacPorts
- [MacPorts] #74043: texlive-bin @2025.74524_1 does not rebuild on PPC Leopard, Mac OS X 10.5.8, because TeX Live sources redefine getopt() and getenv() and in pTeX a variable is named "bool"!
MacPorts
- [MacPorts] #74043: texlive-bin @2025.74524_1 does not rebuild on PPC Leopard, Mac OS X 10.5.8, because TeX Live sources redefine getopt() and getenv() and in pTeX a variable is named "bool"!
MacPorts
- [MacPorts] #74043: texlive-bin @2025.74524_1 does not rebuild on PPC Leopard, Mac OS X 10.5.8, because TeX Live sources redefine getopt() and getenv() and in pTeX a variable is named "bool"!
MacPorts
- [MacPorts] #74043: texlive-bin @2025.74524_1 does not rebuild on PPC Leopard, Mac OS X 10.5.8, because TeX Live sources redefine getopt() and getenv() and in pTeX a variable is named "bool"!
MacPorts
- [MacPorts] #74030: nqc: build fails on Apple Silicon (arm64) with two source bugs
MacPorts
- [MacPorts] #74043: texlive-bin @2025.74524_1 does not rebuild on PPC Leopard, Mac OS X 10.5.8, because TeX Live sources redefine getopt() and getenv() and in pTeX a variable is named "bool"!
MacPorts
- [MacPorts] #74043: texlive-bin @2025.74524_1 does not rebuild on PPC Leopard, Mac OS X 10.5.8, because TeX Live sources redefine getopt() and getenv() and in pTeX a variable is named "bool"!
MacPorts
- [MacPorts] #73987: nodejs24: where is npm??
MacPorts
- [MacPorts] #74038: Please create a port for libltdl
MacPorts
- [MacPorts] #74038: Please create a port for libltdl
MacPorts
- [MacPorts] #74043: texlive-bin @2025.74524_1 does not rebuild on PPC Leopard, Mac OS X 10.5.8, because TeX Live sources redefine getopt() and getenv() and in pTeX a variable is named "bool"!
MacPorts
- [MacPorts] #74042: grass, qgis3: after update to grass 8.5, the GRASS algorithms are no longer available in qgis3
MacPorts
- [MacPorts] #74038: Please create a port for libltdl
MacPorts
- [MacPorts] #74042: grass, qgis3: after update to grass 8.5, the GRASS algorithms are no longer available in qgis3
MacPorts
- [MacPorts] #74043: texlive-bin @2025.74524_1 does not rebuild on PPC Leopard, Mac OS X 10.5.8, because TeX Live sources redefine getopt() and getenv() and in pTeX a variable is named "bool"!
MacPorts
- [MacPorts] #74044: jxrlib @1.3.8 does not build on PPC Leopard, Mac OS X 10.6.8, because of error: expected ‘)’ before ‘bits’
MacPorts
- Re: [MacPorts] #74044: jxrlib @1.3.8 does not build on PPC Leopard, Mac OS X 10.6.8, because of error: expected ‘)’ before ‘bits’
MacPorts
- [MacPorts] #74042: grass, qgis3: after update to grass 8.5, the GRASS algorithms are no longer available in qgis3
MacPorts
- [MacPorts] #48049: verbiste @0.1.41
MacPorts
- [MacPorts] #74045: expat @2.8.1 does not build on PPC Leopard, Mac OS X 10.5.8, because of error: 'O_CLOEXEC' undeclared (first use in this function)
MacPorts
- [MacPorts] #74045: expat @2.8.1 does not build on PPC Leopard, Mac OS X 10.5.8, because of error: 'O_CLOEXEC' undeclared (first use in this function)
MacPorts
- [MacPorts] #74039: x265 @4.2 does not build on PPC Leopard, Mac OS X 10.5.8, because of Undefined symbols
MacPorts
- [MacPorts] #64716: qgis3 installed but not starting due to uninitialized application path
MacPorts
- [MacPorts] #65520: qgis3 @3.26.1: builds failing across-the-board
MacPorts
- [MacPorts] #72594: qgis3: GRASS Plugin fails to load in macOS Sequoia 15.5 despite proper installation
MacPorts
- [MacPorts] #32166: claws-mail+quartz
MacPorts
- [MacPorts] #67844: Python error launching QGIS 3.32.0 RC Lima
MacPorts
- [MacPorts] #74042: grass, qgis3: after update to grass 8.5, the GRASS algorithms are no longer available in qgis3
MacPorts
- [MacPorts] #74042: grass, qgis3: after update to grass 8.5, the GRASS algorithms are no longer available in qgis3
MacPorts
- [MacPorts] #74045: expat @2.8.1 does not build on PPC Leopard, Mac OS X 10.5.8, because of error: 'O_CLOEXEC' undeclared (first use in this function)
MacPorts
- [MacPorts] #71697: multiple ports: vala is specified as lib dependency rather than build dependency
MacPorts
- [MacPorts] #73530: qgis3 Add QtDesigner
MacPorts
- [MacPorts] #74002: icu @78.3_1: fails to upgrade on x86_64 Tahoe with: configure: error: Python failed to run: ValueError: source code string cannot contain null bytes
MacPorts
- [MacPorts] #69925: yorick-av: update to 0.0.6
MacPorts
- [MacPorts] #74046: Nettle +universal fails to build on tahoe
MacPorts
- [MacPorts] #74046: Nettle +universal fails to build on tahoe
MacPorts
- [MacPorts] #74045: expat @2.8.1 does not build on PPC Leopard, Mac OS X 10.5.8, because of error: 'O_CLOEXEC' undeclared (first use in this function)
MacPorts
- [MacPorts] #74045: expat @2.8.1 does not build on PPC Leopard, Mac OS X 10.5.8, because of error: 'O_CLOEXEC' undeclared (first use in this function)
MacPorts
- [MacPorts] #74046: Nettle +universal fails to build on tahoe
MacPorts
- Re: [MacPorts] #74044: jxrlib @1.3.8 does not build on PPC Leopard, Mac OS X 10.6.8, because of error: expected ‘)’ before ‘bits’
MacPorts
- [MacPorts] #74045: expat @2.8.1 does not build on PPC Leopard, Mac OS X 10.5.8, because of error: 'O_CLOEXEC' undeclared (first use in this function)
MacPorts
- [MacPorts] #74041: opendx @4.4.4: patch fails
MacPorts
- [MacPorts] #74047: py314-meson cross file arm64-darwin missing subsystem = 'macos', breaks glib2-bootstrap +universal on Intel macOS builder
MacPorts
- [MacPorts] #73976: glib2-bootstrap @2.88.1_0+universal+x11 Failed to configure
MacPorts
- [MacPorts] #74042: grass, qgis3: after update to grass 8.5, the GRASS algorithms are no longer available in qgis3
MacPorts
- [MacPorts] #74042: grass, qgis3: after update to grass 8.5, the GRASS algorithms are no longer available in qgis3
MacPorts
- [MacPorts] #73853: texlive-bin @2026.78235 does not build on PPC Leopard, Mac OS X 10.5.8, because of error: implicit declaration of function 'CTRunGetAdvances'
MacPorts
- [MacPorts] #74048: dvisvgm-3.6 does not test successfully on PPC Leopard, Mac OS X 10.5.8, because of a dozen failures, possibly C++ related
MacPorts
- [MacPorts] #74048: dvisvgm-3.6 does not test successfully on PPC Leopard, Mac OS X 10.5.8, because of a dozen failures, possibly C++ related
MacPorts
- [MacPorts] #74048: dvisvgm-3.6 does not test successfully on PPC Leopard, Mac OS X 10.5.8, because of a dozen failures, possibly C++ related
MacPorts
- [MacPorts] #74035: dvisvgm-3.6 does not build on PPC Leopard, Mac OS X 10.5.8, because of configure not finding kpathsea/kpathsea.h
MacPorts
- [MacPorts] #74035: dvisvgm-3.6 does not build on PPC Leopard, Mac OS X 10.5.8, because of configure not finding kpathsea/kpathsea.h
MacPorts
- [MacPorts] #73757: openssh: User logins fail: error: PAM: pam_open_session(): Cannot make/remove an entry for the specified session
MacPorts
- [MacPorts] #74049: Failed to configure gmic-gimp mac os tahoe 26.5 M5 macbook pro
MacPorts
- [MacPorts] #73976: glib2-bootstrap @2.88.1_0+universal+x11 Failed to configure
MacPorts
- [MacPorts] #74050: Out of date
MacPorts
- [MacPorts] #74050: scrcpy: please update to latest upstream version (was: Out of date)
MacPorts
- [MacPorts] #74047: py314-meson cross file arm64-darwin missing subsystem = 'macos', breaks glib2-bootstrap +universal on Intel macOS builder
MacPorts
- [MacPorts] #73976: glib2-bootstrap @2.88.1_0+universal+x11 Failed to configure
MacPorts
- [MacPorts] #74047: py314-meson cross file arm64-darwin missing subsystem = 'macos', breaks glib2-bootstrap +universal on Intel macOS builder
MacPorts
- [MacPorts] #74049: gmic-gimp: configure failure (was: Failed to configure gmic-gimp mac os tahoe 26.5 M5 macbook pro)
MacPorts
- [MacPorts] #67844: Python error launching QGIS 3.32.0 RC Lima
MacPorts
- [MacPorts] #74045: expat @2.8.1 does not build on PPC Leopard, Mac OS X 10.5.8, because of error: 'O_CLOEXEC' undeclared (first use in this function)
MacPorts
- Re: [MacPorts] #74044: jxrlib @1.3.8 does not build on PPC Leopard, Mac OS X 10.6.8, because of error: expected ‘)’ before ‘bits’
MacPorts
- [MacPorts] #73757: openssh: User logins fail: error: PAM: pam_open_session(): Cannot make/remove an entry for the specified session
MacPorts
- Re: [MacPorts] #74044: jxrlib @1.3.8 does not build on PPC Leopard, Mac OS X 10.6.8, because of error: expected ‘)’ before ‘bits’
MacPorts
- [MacPorts] #74050: scrcpy: please update to latest upstream version
MacPorts
- [MacPorts] #73351: x264: Build failed with +universal and MacOSX10.13.sdk
MacPorts
- [MacPorts] #72469: wxmaxima does not open a file dialog so it can't save files
MacPorts
- [MacPorts] #74051: fox toolkit fails to build on Leopard/ppc32
MacPorts
- [MacPorts] #72288: new port request: dlang --based on ldc2 -- MacOS arm64 build exists on GitHub
MacPorts
- [MacPorts] #74052: ldc: Undefined symbols for architecture arm64
MacPorts
- [MacPorts] #74052: ldc: Undefined symbols for architecture arm64
MacPorts
- [MacPorts] #74052: ldc: Undefined symbols for architecture arm64
MacPorts
- [MacPorts] #73757: openssh: User logins fail: error: PAM: pam_open_session(): Cannot make/remove an entry for the specified session
MacPorts
- [MacPorts] #74053: Update neomutt
MacPorts
- [MacPorts] #74054: yt-dlp: Update to latest version
MacPorts
- [MacPorts] #74051: fox toolkit fails to build on Leopard/ppc32
MacPorts
- [MacPorts] #74053: Update neomutt
MacPorts
- [MacPorts] #74002: icu @78.3_1: fails to upgrade on x86_64 Tahoe with: configure: error: Python failed to run: ValueError: source code string cannot contain null bytes
MacPorts
- [MacPorts] #74002: icu @78.3_1: fails to upgrade on x86_64 Tahoe with: configure: error: Python failed to run: ValueError: source code string cannot contain null bytes
MacPorts
- [MacPorts] #74054: yt-dlp: Update to latest version
MacPorts
- [MacPorts] #73992: yt-dlp version: 2026.03.17 category: net (update to 2026.05.05 nightly)
MacPorts
- [MacPorts] #74051: fox toolkit fails to build on Leopard/ppc32
MacPorts
- [MacPorts] #74045: expat @2.8.1 does not build on PPC Leopard, Mac OS X 10.5.8, because of error: 'O_CLOEXEC' undeclared (first use in this function)
MacPorts
- [MacPorts] #74002: icu @78.3_1: fails to upgrade on x86_64 Tahoe with: configure: error: Python failed to run: ValueError: source code string cannot contain null bytes
MacPorts
- [MacPorts] #74040: arm64 build machine is offline
MacPorts
- [MacPorts] #74055: qt5-qtconnectivity-docs @5.15.19: patch fails
MacPorts
- [MacPorts] #74056: deno-2.8.1 not available on macports mirrors for updating
MacPorts
- [MacPorts] #74057: emacs-app fails to find gcc driver
MacPorts
- [MacPorts] #74058: vineserver3 failed to fetch its sources from cvs
MacPorts
- [MacPorts] #74026: gmic-qt fails: Version numbers of files 'gmic.h' (376) and 'CImg.h' (377) mismatch
MacPorts
- [MacPorts] #74026: gmic-qt fails: Version numbers of files 'gmic.h' (376) and 'CImg.h' (377) mismatch
MacPorts
- [MacPorts] #74049: gmic-gimp: configure failure
MacPorts
- [MacPorts] #74049: gmic-gimp: configure failure
MacPorts
- [MacPorts] #74026: gmic-qt fails: Version numbers of files 'gmic.h' (376) and 'CImg.h' (377) mismatch
MacPorts
- [MacPorts] #74056: deno-2.8.1 not available on macports mirrors for updating
MacPorts
- [MacPorts] #55898: ocaml-gsl @0.6.0: error: use of undeclared identifier 'caml__frame'
MacPorts
- [MacPorts] #74059: Update py-qrcode for the newest python version
MacPorts
- [MacPorts] #74060: mfa Fails to Build -- Symbol not found: _SecTrustCopyCertificateChain
MacPorts
- [MacPorts] #74060: mfa Fails to Build -- Symbol not found: _SecTrustCopyCertificateChain
MacPorts
- [MacPorts] #74056: deno-2.8.1 not available on macports mirrors for updating
MacPorts
- [MacPorts] #74056: deno-2.8.1 not available on macports mirrors for updating
MacPorts
- [MacPorts] #74061: Ridiculously slow download speed from MacPorts packages repository
MacPorts
- [MacPorts] #74056: deno-2.8.1 not available on macports mirrors for updating
MacPorts
- [MacPorts] #74057: emacs-app fails to find gcc driver
MacPorts
- [MacPorts] #74058: vineserver3 failed to fetch its sources from cvs
MacPorts
- [MacPorts] #65160: fastly downloads throttled (was: package fetch does not honor preferred_hosts; fastly downloads throttled)
MacPorts
- [MacPorts] #74061: Ridiculously slow download speed from MacPorts packages repository
MacPorts
- [MacPorts] #65160: fastly downloads throttled
MacPorts
- [MacPorts] #65160: fastly downloads throttled
MacPorts
- [MacPorts] #74059: Update py-qrcode for the newest python version
MacPorts
Last message date:
Sun May 31 21:35:35 UTC 2026
Archived on: Sun May 31 21:35:38 UTC 2026
This archive was generated by
Pipermail 0.09 (Mailman edition).