[MacPorts] #74424: imlib2 @1.12.7 does not build on PPC Leopard, Mac OS X 10.5.8, because of error: unknown field 'cdata' specified in initializer

MacPorts noreply at macports.org
Sun Sep 13 10:22:41 UTC 2026


#74424: imlib2 @1.12.7 does not build on PPC Leopard, Mac OS X 10.5.8, because of
error: unknown field 'cdata' specified in initializer
-------------------------+--------------------
 Reporter:  ballapete    |      Owner:  (none)
     Type:  defect       |     Status:  new
 Priority:  Normal       |  Milestone:
Component:  ports        |    Version:  2.12.6
 Keywords:  ppc leopard  |       Port:  imlib2
-------------------------+--------------------
 {{{
   CC       scale.lo
 scale.c:14: warning: expected [error|warning|ignored] after '#pragma GCC
 diagnostic'
 In file included from scale.c:16:
 ../../third-party/uscaler.h: In function 'usc__read_as_bgra32':
 ../../third-party/uscaler.h:286: warning: implicit declaration of function
 '__builtin_unreachable'
 ../../third-party/uscaler.h: In function 'usc_resize':
 ../../third-party/uscaler.h:1040: error: unknown field 'cdata' specified
 in initializer
 ../../third-party/uscaler.h:1040: warning: missing braces around
 initializer
 ../../third-party/uscaler.h:1040: warning: (near initialization for
 '(anonymous).<anonymous>')
 ../../third-party/uscaler.h:1046: error: unknown field 'data' specified in
 initializer
 ../../third-party/uscaler.h:1046: warning: missing braces around
 initializer
 ../../third-party/uscaler.h:1046: warning: (near initialization for
 '(anonymous).<anonymous>')
 scale.c: At top level:
 scale.c:17: warning: expected [error|warning|ignored] after '#pragma GCC
 diagnostic'
 scale.c: In function '__imlib_Scale':
 scale.c:1113: error: unknown field 'cdata' specified in initializer
 scale.c:1113: warning: missing braces around initializer
 scale.c:1113: warning: (near initialization for '(anonymous).<anonymous>')
 scale.c:1120: error: unknown field 'data' specified in initializer
 scale.c:1120: warning: missing braces around initializer
 scale.c:1120: warning: (near initialization for '(anonymous).<anonymous>')
 make[3]: *** [scale.lo] Error 1
 make[3]: Leaving directory
 `/opt/local/var/macports/build/imlib2-d3d33cc1/work/imlib2-1.12.7/src/lib'
 }}}

-- 
Ticket URL: <https://trac.macports.org/ticket/74424>
MacPorts <https://www.macports.org/>
Ports system for macOS


More information about the macports-tickets mailing list