pdftk/gcc41 build error on 10.4.8 Intel

Andrew Berry andrewberry at sentex.net
Sun Mar 18 08:50:11 PDT 2007

On 5-Mar-07, at 10:07 PM, Yves de Champlain wrote:

> I just commited a fix.

Thanks. It looks like pdftk still isn't building properly:

blizzdoze:andrew/ andrew$ sudo port install pdftk
--->  Building pdftk with target all
Error: Target com.apple.build returned: shell command "cd "/opt/local/ 
orts_textproc_pdftk/work/pdftk-1.41/pdftk" && make all -f  
Makefile.MacOSX TOOLPATH=/opt/local/bin/ VERSUFF=-dp-4.1" returned  
error 2
Command output: make -C ../java_libs
make -C "/opt/local/var/db/dports/build/ 
/opt/local/bin/gcj-dp-4.1 -O2 --encoding=UTF-8 --classpath="/opt/ 
orts_textproc_pdftk/work/pdftk-1.41/java_libs" -c Engine.java -o  
gcj-dp-4.1: libgcj.spec: No such file or directory
make[2]: *** [Engine.o] Error 1
make[1]: *** [libgcj_local] Error 2
make: *** [java_libs] Error 2

Error: Status 1 encountered during processing.
-------------- next part --------------
A non-text attachment was scrubbed...
Name: PGP.sig
Type: application/pgp-signature
Size: 186 bytes
Desc: This is a digitally signed message part
Url : http://lists.macosforge.org/pipermail/macports-users/attachments/20070318/983ced91/PGP.bin

More information about the macports-users mailing list