orbit2 duplicate symbol

William Davis frstan at bellsouth.net
Sat Nov 3 10:03:32 PDT 2007

here is another of these
orbit2 build failed on Leopard
mkdir .libs
gcc -O2 -Werror-implicit-function-declaration -o test-linc test- 
linc.o  -L/opt/local/lib ../src/.libs/liblinc.a /opt/local/lib/ 
libgobject-2.0.dylib /opt/local/lib/libgthread-2.0.dylib /opt/local/ 
lib/libglib-2.0.dylib /opt/local/lib/libintl.dylib -lc /opt/local/lib/ 
libiconv.dylib -lresolv
ld: duplicate symbol _g_bit_nth_lsf in ../src/.libs/liblinc.a(linc- 
protocols.o) and test-linc.o

collect2: ld returned 1 exit status
make[3]: *** [test-linc] Error 1
make[2]: *** [all-recursive] Error 1
make[1]: *** [all-recursive] Error 1
make: *** [all] Error 2

Warning: the following items did not execute (for orbit2):  
org.macports.destroot org.macports.build
Error: Unable to upgrade port: 1

William Davis
-------------- next part --------------
An HTML attachment was scrubbed...
URL: http://lists.macosforge.org/pipermail/macports-users/attachments/20071103/6ab037c4/attachment.html

More information about the macports-users mailing list