Installing gnuplot fails

mike jones michael.daniel.jones at
Fri Sep 14 09:30:19 PDT 2007

Hi :)
Today I tried to install gnuplots on my mac and I recieved the following
error :(

5acff429:~ mike$ sudo port install gnuplot
--->  Building texinfo with target all
Error: Target returned: shell command " cd
4.11" && make all " returned error 2
Command output: make  all-recursive
Making all in gnulib/lib
../../build-aux/install-sh -c -d sys
make[2]: execvp: ../../build-aux/install-sh: Permission denied
make[2]: *** [sys/stat.h] Error 127
make[1]: *** [all-recursive] Error 1
make: *** [all] Error 2

Error: The following dependencies failed to build: teTeX texinfo
Error: Status 1 encountered during processing.
5acff429:~ mike$

FYI the version of MacPorts I have install is 1.520.

Any help would be great.
Thanks :)
-------------- next part --------------
An HTML attachment was scrubbed...

More information about the macports-users mailing list