Trouble upgrading orc

John J. Foster Macports at
Wed Aug 25 18:08:52 PDT 2010

This has been happening for a few days. I do a port update nightly and
don't usually ask about build errors as they are normally corrected
within a day or two. Not this time though, and I don't really know what
to do.

festus at magpie ~/src/mutt $ sudo port upgrade outdated
--->  Computing dependencies for orc
--->  Fetching orc
--->  Verifying checksum(s) for orc
--->  Extracting orc
--->  Configuring orc
--->  Building orc
Error: Target returned: shell command failed
Log for orc is at:
Error: Unable to upgrade port: 1

and ...

festus at magpie ~/src/mutt $ tail -n20 /opt/local/var/macports/logs/_opt_local_var_macports_sources_rsync.macports.org_release_ports_devel_orc/main.log
:info:build libtool: link: sed 's,^,_,' < .libs/liborc-test-0.4.exp > .libs/liborc-test-0.4-symbols.expsym
:info:build libtool: link: /usr/bin/gcc-4.0 -dynamiclib  -o .libs/liborc-test-0.4.0.dylib  .libs/liborc_test_0.4_la-orctest.o
.libs/liborc_test_0.4_la-orcarray.o .libs/liborc_test_0.4_la-orcrandom.o .libs/liborc_test_0.4_la-orcprofile.o   -L/opt/local/lib ../orc/.libs/liborc-0.4.dylib  -arch i386 -arch i386   -install_name /opt/local/lib/liborc-test-0.4.0.dylib -compatibility_version 1 -current_version 1.0 -Wl,-single_module -Wl,-exported_symbols_list,.libs/liborc-test-0.4-symbols.expsym
:info:build Undefined symbols:
:info:build   "_posix_memalign", referenced from:
:info:build       _orc_array_new in liborc_test_0.4_la-orcarray.o
:info:build ld: symbol(s) not found
:info:build collect2: ld returned 1 exit status
:info:build make[2]: *** [] Error 1
:info:build make[1]: *** [all-recursive] Error 1
:info:build make: *** [all] Error 2
:info:build shell command " cd "/opt/local/var/macports/build/_opt_local_var_macports_sources_rsync.macports.org_release_ports_devel_orc/work/orc-0.4.7" && /usr/bin/make all " returned error 2
:error:build Target returned: shell command failed
:debug:build Backtrace: shell command failed
    while executing
"command_exec build"
    (procedure "portbuild::build_main" line 8)
    invoked from within "$procedure $targetname"
:info:build Warning: the following items did not execute (for orc): org.macports.destroot
:notice:build Log for orc is at: /opt/local/var/macports/logs/_opt_local_var_macports_sources_rsync.macports.org_release_ports_devel_orc/main.log

Thanks for any help,

“We have constructed a world in which the potential for high-tech
catastrophe is embedded in the fabric of day-to-day life.”
                                                  Malcolm Gladwell
-------------- next part --------------
A non-text attachment was scrubbed...
Name: not available
Type: application/pgp-signature
Size: 195 bytes
Desc: not available
URL: <>

More information about the macports-users mailing list