Unable to Install CGAL

Pietro Maximoff segment_x at yahoo.com
Fri Jan 8 11:54:55 PST 2010


I tried to install cgal but it always fails with the following error:

ld: pointer in read-only segment not allowed in slidable image, used in ___gmpn_divexact_1 from /usr/local/lib/libgmp.a(dive_1.o)
collect2: ld returned 1 exit status
make[2]: *** [lib/libCGAL_Core.4.0.0.dylib] Error 1
make[1]: *** [src/CGALCore/CMakeFiles/CGAL_Core.dir/all] Error 2
make[1]: *** Waiting for unfinished jobs....
[ 75%] Built target CGAL_PDB
make: *** [all] Error 2

Error: Status 1 encountered during processing.

How can I resolve this?

Best wishes


-------------- next part --------------
An HTML attachment was scrubbed...
URL: <http://lists.macosforge.org/pipermail/macports-users/attachments/20100108/26f21018/attachment.html>

More information about the macports-users mailing list