openjpeg fails to build on ppc/leopard

Kastus Shchuka macports at
Sun Apr 17 22:04:53 PDT 2011


Not sure if it is a known problem--search in trac did not return  
anything relevent (althogh I am not an expert in trac searches)

port outdated lists openjpeg:

openjpeg                       1.3_3 < 1.4-r697_0

port upgrade openjpeg fails with these last lines in the log:

:info:build libtool: link: dsymutil .libs/libopenjpeg.1.dylib || :
:info:build warning: no debug symbols in executable (-arch ppc)
:info:build libtool: link: (cd ".libs" && rm -f "libopenjpeg.dylib" &&  
ln -s "libopenjpeg.1.dylib" "libopenjpeg.dylib")
:info:build libtool: link: ar cru .libs/libopenjpeg.a  bio.o cio.o  
dwt.o event.o image.o j2k.o j2k_lib.o jp2.o jpt.o mct.o mqc.o  
openjpeg.o pi.o raw.o t1.o t2.o tcd.o tgt.o
:info:build libtool: link: ranlib .libs/libopenjpeg.a
:info:build libtool: link: ( cd ".libs" && rm -f "" &&  
ln -s "../l" "" )
:info:build cp: .libs/libopenjpeg.1.dylib.dSYM is a directory (not  
:info:build make[2]: *** [all-local] Error 1
:info:build make[1]: *** [all-recursive] Error 1
:info:build make: *** [all] Error 2
:info:build shell command " cd "/opt/local/var/macports/build/ 
openjpeg_v1_4_sources_r697" && /usr/bin/make all COMPILERFLAGS='-O2 - 
arch ppc' " returned
error 2

This is on iBook G4 running 10.5.8

Should I open a ticket in trac? or is it something missing on my system?

I am also attaching full log.

-------------- next part --------------
A non-text attachment was scrubbed...
Name: openjpeg-main.log.gz
Type: application/x-gzip
Size: 5916 bytes
Desc: not available
URL: <>
-------------- next part --------------

More information about the macports-users mailing list