tmux fails to compile on powerpc

Bee 200309 at
Sat Mar 23 00:03:14 PDT 2013

Tried to:
port install tmux

And it failed.

PowerBook G3 Pismo 500MHz

Does it require a newer system? or?


This is the last lines of main.log

" -------1---------2---------3---------4---------5---------6----
:info:build osdep-darwin.c:23:21: error: libproc.h: No such file or  
:info:build osdep-darwin.c: In function ‘osdep_get_cwd’:
:info:build osdep-darwin.c:57: error: storage size of ‘pathinfo’  
isn’t known
:info:build osdep-darwin.c:64: warning: implicit declaration of  
function ‘proc_pidinfo’
:info:build osdep-darwin.c:65: error: ‘PROC_PIDVNODEPATHINFO’  
undeclared (first use in this function)
:info:build osdep-darwin.c:65: error: (Each undeclared identifier is  
reported only once
:info:build osdep-darwin.c:65: error: for each function it appears in.)
:info:build make: *** [osdep-darwin.o] Error 1
:info:build make: Leaving directory `/opt/local/var/macports/build/ 
:info:build Command failed:  cd "/opt/local/var/macports/build/ 
s_tmux/tmux/work/tmux-1.7" && /usr/bin/make -w all
:info:build Exit code: 2
:error:build for port tmux returned: command  
execution failed
:debug:build Error code: CHILDSTATUS 26295 2
:debug:build Backtrace: command execution failed
     while executing
"system -nice 10 $fullcmdstring"
     ("eval" body line 1)
     invoked from within
"eval system $notty $nice \$fullcmdstring"
     invoked from within
"command_exec build"
     (procedure "portbuild::build_main" line 8)
     invoked from within
"$procedure $targetname"
:info:build Warning: targets not executed for tmux:  
org.macports.activate org.macports.destroot  
:notice:build Please see the log file for port tmux for details:
" -------1---------2---------3---------4---------5---------6----

More information about the macports-users mailing list