[MacPorts] #23473: emos install failure
MacPorts
noreply at macports.org
Fri Jan 29 12:05:10 PST 2010
#23473: emos install failure
--------------------------------+-------------------------------------------
Reporter: andfried@… | Owner: takeshi@…
Type: defect | Status: new
Priority: Normal | Milestone:
Component: ports | Version: 1.8.2
Keywords: | Port: emos
--------------------------------+-------------------------------------------
Changes (by jmr@…):
* cc: andfried@… (removed)
* owner: macports-tickets@… => takeshi@…
Old description:
> Hi,
>
> I am unable to install emos on Mac OS 10.5.8 PPC, xcode 3.1.
>
> The error message is below. I have attached the full error message as a
> text file. Any suggestions?
>
> Thanks,
>
> Andrew
>
> Error: Target org.macports.build returned: shell command " cd
> "/opt/local/var/macports/build/_opt_local_var_macports_sources_rsync.macports.org_release_ports_science_emos/work/emos_000371"
> && /usr/bin/make all " returned error 2
> Command output: Error: Real constant overflows its kind at (1)
> make[1]: *** [buens4.o] Error 1
> *************************
> *** Make in crexdc
> *************************
> make[1]: Nothing to be done for `all'.
> *************************
> *** Make in pbio
> *************************
> make[1]: Nothing to be done for `all'.
> *************************
> *** Make in fft
> *************************
> make[1]: Nothing to be done for `all'.
> *************************
> *** Make in bufrtables
> *************************
> ./links.sh
> /opt/local/bin/gfortran-mp-4.3 -O2 -fdefault-real-8 -fcray-pointer -fno-
> second-underscore -DPOINTER_64 -DINTEGER_IS_INT -Dlinux -Dgfortran -o
> bufr2txt_tables bufr2txt_tables.f ../libemosR64.a
> Undefined symbols:
> "_busel_", referenced from:
> _MAIN__ in ccGheBhQ.o
> "_bufrex_", referenced from:
> _MAIN__ in ccGheBhQ.o
> "_bus012_", referenced from:
> _MAIN__ in ccGheBhQ.o
> ld: symbol(s) not found
> collect2: ld returned 1 exit status
> make[1]: *** [bufr2txt_tables] Error 1
> make: *** [all] Error 2
>
> Error: Status 1 encountered during processing.
New description:
Hi,
I am unable to install emos on Mac OS 10.5.8 PPC, xcode 3.1.
The error message is below. I have attached the full error message as a
text file. Any suggestions?
Thanks,
Andrew
{{{
Error: Target org.macports.build returned: shell command " cd
"/opt/local/var/macports/build/_opt_local_var_macports_sources_rsync.macports.org_release_ports_science_emos/work/emos_000371"
&& /usr/bin/make all " returned error 2
Command output: Error: Real constant overflows its kind at (1)
make[1]: *** [buens4.o] Error 1
*************************
*** Make in crexdc
*************************
make[1]: Nothing to be done for `all'.
*************************
*** Make in pbio
*************************
make[1]: Nothing to be done for `all'.
*************************
*** Make in fft
*************************
make[1]: Nothing to be done for `all'.
*************************
*** Make in bufrtables
*************************
./links.sh
/opt/local/bin/gfortran-mp-4.3 -O2 -fdefault-real-8 -fcray-pointer -fno-
second-underscore -DPOINTER_64 -DINTEGER_IS_INT -Dlinux -Dgfortran -o
bufr2txt_tables bufr2txt_tables.f ../libemosR64.a
Undefined symbols:
"_busel_", referenced from:
_MAIN__ in ccGheBhQ.o
"_bufrex_", referenced from:
_MAIN__ in ccGheBhQ.o
"_bus012_", referenced from:
_MAIN__ in ccGheBhQ.o
ld: symbol(s) not found
collect2: ld returned 1 exit status
make[1]: *** [bufr2txt_tables] Error 1
make: *** [all] Error 2
Error: Status 1 encountered during processing.
}}}
--
Comment:
Please remember to preview and use WikiFormatting, and to cc the
maintainer. Also note that you do not need to be in cc when you are the
reporter.
--
Ticket URL: <http://trac.macports.org/ticket/23473#comment:2>
MacPorts <http://www.macports.org/>
Ports system for Mac OS
More information about the macports-tickets
mailing list