can't build kdelibs4 universal

Payam Minoofar payam.minoofar at
Fri Mar 12 09:49:46 PST 2010

This happens consistently during the building kdepimlibs4 during the kdelibs4 process. I'm on an iMac running 10.6.2.

Do I need to install gpgme-objc?

Thanks in advance.

ditInteractor>, GpgME::Data&)in context.o
  "_gpgme_op_trustlist_end", referenced from:
      GpgME::Context::endTrustItemListing()     in context.o
  "_gpgme_get_key", referenced from:
      GpgME::Context::key(char const*, GpgME::Error&, bool)in context.o
  "_gpgme_data_new_from_cbs", referenced from:
      GpgME::Data::Data(GpgME::DataProvider*)in data.o
  "_gpgme_data_get_encoding", referenced from:
      GpgME::Data::encoding() constin data.o
  "_gpgme_set_io_cbs", referenced from:
      GpgME::Context::uninstallIOCallbacks()     in context.o
      GpgME::Context::installIOCallbacks(gpgme_io_cbs*)      in context.o
ld: symbol(s) not found
collect2: ld returned 1 exit status
lipo: can't open input file: /var/tmp//cct97muK.out (No such file or directory)
lipo: can't open input file: /var/tmp//ccja6l81.out (No such file or directory)
make[2]: *** [lib/libgpgme++-pth.2.4.0.dylib] Error 1
make[1]: *** [gpgme++/CMakeFiles/gpgmepp-pth.dir/all] Error 2
make[1]: *** Waiting for unfinished jobs....
make[2]: *** [lib/libgpgme++.2.4.0.dylib] Error 1
make[1]: *** [gpgme++/CMakeFiles/gpgmepp.dir/all] Error 2
make: *** [all] Error 2
Error: Target returned: shell command " cd "/opt/local/var/macports/build/_opt_local_var_macports_sources_rsync.macports.org_release_ports_kde_kdepimlibs4/work/build" && /usr/bin/make -j2 all " returned error 2
DEBUG: Backtrace: shell command " cd "/opt/local/var/macports/build/_opt_local_var_macports_sources_rsync.macports.org_release_ports_kde_kdepimlibs4/work/build" && /usr/bin/make -j2 all " returned error 2
    while executing
"command_exec build"
    (procedure "portbuild::build_main" line 9)
    invoked from within
"$procedure $targetname"
Warning: the following items did not execute (for kdepimlibs4): org.macports.activate org.macports.destroot org.macports.install
Error: The following dependencies failed to build: kdebase4-runtime kdepimlibs4 qtscriptgenerator taglib taglib-extras
Error: Status 1 encountered during processing.

Payam Minoofar, Ph.D.
Meissner Filtration Products
4181 Calle Tesoro
Camarillo, CA 93012
+1 805 388 9911 ext. 159
+1 805 388 5948 fax
payam.minoofar at
-------------- next part --------------
A non-text attachment was scrubbed...
Name: Payam Minoofar.vcf
Type: text/directory
Size: 28368 bytes
Desc: Payam Minoofar.vcf
URL: <>
-------------- next part --------------
An embedded and charset-unspecified text was scrubbed...
Name: ATT00001..txt
URL: <>

More information about the macports-users mailing list