gnome desktop suite fail part 3

Bob Katz bocat01 at
Tue Oct 19 22:46:09 PDT 2010


Could anybody please look at the below terminal outputted errors and tell me
what I might do next ?



--->  Building gnome-utils
DEBUG: build phase started at Wed Oct 20 01:17:46 EDT 2010
DEBUG: Executing (gnome-utils)
DEBUG: Environment: CPATH='/opt/local/include'
DEBUG: Assembled command: 'cd
&& /usr/bin/make -j2 all'
Making all in m4
Making all in po
Making all in libeggsmclient
Making all in baobab
Making all in src
Making all in data
Making all in pixmaps
Making all in 24x24
Making all in scalable
Making all in help
Making all in gnome-dictionary
Making all in libgdict
  CC    gdict-defbox.o
  CC    gdict-database-chooser.o
./gdict-database-chooser.c: In function 'gdict_database_chooser_add_button':
./gdict-database-chooser.c:1135: error: lvalue required as left operand of
make[4]: *** [libgdict_1_0_la-gdict-database-chooser.lo] Error 1
make[4]: *** Waiting for unfinished jobs....
make[3]: *** [all] Error 2
make[2]: *** [all-recursive] Error 1
make[1]: *** [all-recursive] Error 1
make: *** [all] Error 2
shell command " cd
&& /usr/bin/make -j2 all " returned error 2
Error: Target returned: shell command failed
DEBUG: Backtrace: shell command failed
    while executing
"command_exec build"
    (procedure "portbuild::build_main" line 8)
    invoked from within
"$procedure $targetname"
Warning: the following items did not execute (for gnome-utils):
org.macports.activate org.macports.destroot
Log for gnome-utils is at:
Error: The following dependencies failed to build: gnome-utils
gst-plugins-good flac libcaca libcdio libcddb libdv libshout2 taglib wavpack
gvfs libarchive libgail-gnome libgtkhtml3 liboobs system-tools-backends
p5-net-dbus p5-xml-twig seahorse gpgme gnupg pth openssh xauth
seahorse-plugins totem gst-ffmpeg gst-plugins-bad jack libsamplerate
libsndfile libdca libmms libmodplug libmpcdec neon soundtouch
gst-plugins-ugly a52dec libdvdread libdvdcss libid3tag libmad libmpeg2
xorg-libXv xorg-videoproto twolame libgdata xorg-libXxf86vm
xorg-xf86vidmodeproto vino
Error: Status 1 encountered during processing.
To report a bug, see <>
-------------- next part --------------
An HTML attachment was scrubbed...
URL: <>

More information about the macports-users mailing list